Re: Checkout develop source and nifi-kite-processors can��t find dependencies

classic Classic list List threaded Threaded
7 messages Options
Reply | Threaded
Open this post in threaded view
|

Re: Checkout develop source and nifi-kite-processors can��t find dependencies

Mark Payne
Toivo,


Everything appears to be okay for me…


Did you rebuild from the root ‘nifi’ directory? Please make sure that you rebuild from that level and that you are not running Maven offline.


If you have done this, please inform so that we can dig deeper.


Thanks

-Mark






From: [hidden email]
Sent: ‎Monday‎, ‎March‎ ‎9‎, ‎2015 ‎7‎:‎45‎ ‎AM
To: [hidden email]





Checkout develop source and nifi-kite-processors can’t find dependencies
    <dependency>
      <groupId>org.kitesdk</groupId>
      <artifactId>kite-minicluster</artifactId>
      <version>${kite.version}</version>
      <scope>test</scope>
    </dependency>

Leads to
Description     Resource        Path    Location        Type
Missing artifact org.apache.flume:flume-ng-node:jar:1.4.0-cdh5.0.0      pom.xml
/nifi-kite-processors   line 1  Maven Dependency Problem
Missing artifact org.apache.hbase:hbase-client:jar:0.96.1.1-cdh5.0.0    pom.xml
/nifi-kite-processors   line 1  Maven Dependency Problem
Missing artifact org.apache.hbase:hbase-server:jar:0.96.1.1-cdh5.0.0    pom.xml
/nifi-kite-processors   line 1  Maven Dependency Problem
Missing artifact org.apache.hbase:hbase-testing-util:jar:0.96.1.1-cdh5.0.0
pom.xml /nifi-kite-processors   line 1  Maven Dependency Problem
Missing artifact org.apache.hive:hive-common:jar:0.12.0-cdh5.0.0        pom.xml
/nifi-kite-processors   line 1  Maven Dependency Problem
Missing artifact org.apache.hive:hive-exec:jar:0.12.0-cdh5.0.0  pom.xml
/nifi-kite-processors   line 1  Maven Dependency Problem
Missing artifact org.apache.hive:hive-metastore:jar:0.12.0-cdh5.0.0     pom.xml
/nifi-kite-processors   line 1  Maven Dependency Problem
Missing artifact org.apache.hive:hive-serde:jar:0.12.0-cdh5.0.0 pom.xml
/nifi-kite-processors   line 1  Maven Dependency Problem
Missing artifact org.apache.hive:hive-service:jar:0.12.0-cdh5.0.0       pom.xml
/nifi-kite-processors   line 1  Maven Dependency Problem

Last week there was no such problem

Toivo




--
View this message in context: http://apache-nifi-incubating-developer-list.39713.n7.nabble.com/Checkout-develop-source-and-nifi-kite-processors-can-t-find-dependencies-tp899.html
Sent from the Apache NiFi (incubating) Developer List mailing list archive at Nabble.com.
Reply | Threaded
Open this post in threaded view
|

Re: Checkout develop source and nifi-kite-processors can��t find dependencies

Toivo Adams
Mark,

Thanks

I did full rebuild from the root ‘nifi’ directory.
Same problems.
But for example:
    Missing artifact org.apache.flume:flume-ng-node:jar:1.4.0-cdh5.0.0
But as far I understand Maven tries to load this from Maven repo.
Looking
http://mvnrepository.com/artifact/org.apache.flume/flume-ng-node/1.4.0
there is no such version?

It exist in cloudera repo and may be in some other repo

. . .

[INFO] ------------------------------------------------------------------------
[INFO] Building Kite Hadoop Processors 0.0.2-incubating-SNAPSHOT
[INFO] ------------------------------------------------------------------------
[WARNING] The POM for org.apache.hbase:hbase-client:jar:0.96.1.1-cdh5.0.0 is missing, no dependency information available
[WARNING] The POM for org.apache.hbase:hbase-server:jar:0.96.1.1-cdh5.0.0 is missing, no dependency information available
[WARNING] The POM for org.apache.hadoop:hadoop-common:jar:tests:2.3.0-cdh5.0.0 is missing, no dependency information available
[WARNING] The POM for org.apache.hadoop:hadoop-hdfs:jar:tests:2.3.0-cdh5.0.0 is missing, no dependency information available
[WARNING] The POM for org.apache.hadoop:hadoop-minicluster:jar:2.3.0-cdh5.0.0 is missing, no dependency information available
[WARNING] The POM for org.apache.hbase:hbase-testing-util:jar:0.96.1.1-cdh5.0.0 is missing, no dependency information available
[WARNING] The POM for org.apache.hive:hive-metastore:jar:0.12.0-cdh5.0.0 is missing, no dependency information available
[WARNING] The POM for org.apache.hive:hive-common:jar:0.12.0-cdh5.0.0 is missing, no dependency information available
[WARNING] The POM for org.apache.hive:hive-serde:jar:0.12.0-cdh5.0.0 is missing, no dependency information available
[WARNING] The POM for org.apache.hive:hive-exec:jar:0.12.0-cdh5.0.0 is missing, no dependency information available
[WARNING] The POM for org.apache.hive:hive-service:jar:0.12.0-cdh5.0.0 is missing, no dependency information available
[WARNING] The POM for org.apache.flume:flume-ng-node:jar:1.4.0-cdh5.0.0 is missing, no dependency information available
[INFO] ------------------------------------------------------------------------
[INFO] Reactor Summary:
[INFO]
[INFO] nifi .............................................. SUCCESS [  2.723 s]
[INFO] nifi-api .......................................... SUCCESS [  4.992 s]
[INFO] nifi-commons ...................................... SUCCESS [  0.050 s]
[INFO] nifi-utils ........................................ SUCCESS [  8.123 s]
[INFO] nifi-data-provenance-utils ........................ SUCCESS [  1.101 s]
[INFO] nifi-flowfile-packager ............................ SUCCESS [  1.841 s]
[INFO] nifi-expression-language .......................... SUCCESS [  8.179 s]
[INFO] nifi-logging-utils ................................ SUCCESS [  0.700 s]
[INFO] nifi-properties ................................... SUCCESS [  0.813 s]
[INFO] nifi-security-utils ............................... SUCCESS [  0.911 s]
[INFO] nifi-socket-utils ................................. SUCCESS [  2.221 s]
[INFO] nifi-web-utils .................................... SUCCESS [  1.492 s]
[INFO] nifi-processor-utils .............................. SUCCESS [  2.100 s]
[INFO] nifi-write-ahead-log .............................. SUCCESS [  7.358 s]
[INFO] nifi-nar-bundles .................................. SUCCESS [  0.050 s]
[INFO] nifi-framework-bundle ............................. SUCCESS [  0.055 s]
[INFO] nifi-framework .................................... SUCCESS [  0.051 s]
[INFO] nifi-client-dto ................................... SUCCESS [  3.169 s]
[INFO] nifi-site-to-site-client .......................... SUCCESS [  3.539 s]
[INFO] nifi-bootstrap .................................... SUCCESS [  1.021 s]
[INFO] nifi-mock ......................................... SUCCESS [  2.630 s]
[INFO] nifi-nar-utils .................................... SUCCESS [  1.107 s]
[INFO] nifi-runtime ...................................... SUCCESS [  1.129 s]
[INFO] nifi-framework-core-api ........................... SUCCESS [  2.311 s]
[INFO] nifi-security ..................................... SUCCESS [  2.316 s]
[INFO] nifi-user-actions ................................. SUCCESS [  0.809 s]
[INFO] nifi-administration ............................... SUCCESS [  4.979 s]
[INFO] nifi-site-to-site ................................. SUCCESS [  3.522 s]
[INFO] nifi-framework-cluster-protocol ................... SUCCESS [  8.706 s]
[INFO] nifi-framework-core ............................... SUCCESS [01:03 min]
[INFO] nifi-web .......................................... SUCCESS [  0.050 s]
[INFO] nifi-web-optimistic-locking ....................... SUCCESS [  0.771 s]
[INFO] nifi-framework-cluster-web ........................ SUCCESS [  1.171 s]
[INFO] nifi-framework-cluster ............................ SUCCESS [ 30.980 s]
[INFO] nifi-file-authorization-provider .................. SUCCESS [  2.031 s]
[INFO] nifi-cluster-authorization-provider ............... SUCCESS [  2.353 s]
[INFO] nifi-custom-ui-utilities .......................... SUCCESS [  0.730 s]
[INFO] nifi-web-security ................................. SUCCESS [  4.674 s]
[INFO] nifi-provenance-repository-bundle ................. SUCCESS [  0.040 s]
[INFO] nifi-volatile-provenance-repository ............... SUCCESS [  2.062 s]
[INFO] nifi-web-api ...................................... SUCCESS [ 44.164 s]
[INFO] nifi-web-error .................................... SUCCESS [  0.960 s]
[INFO] nifi-web-docs ..................................... SUCCESS [  1.091 s]
[INFO] nifi-web-ui ....................................... SUCCESS [ 10.967 s]
[INFO] nifi-jetty ........................................ SUCCESS [  8.974 s]
[INFO] nifi-resources .................................... SUCCESS [  0.800 s]
[INFO] nifi-framework-nar ................................ SUCCESS [  3.734 s]
[INFO] nifi-hadoop-bundle ................................ SUCCESS [  0.040 s]
[INFO] nifi-hdfs-processors .............................. SUCCESS [  7.237 s]
[INFO] nifi-standard-services ............................ SUCCESS [  0.040 s]
[INFO] nifi-ssl-context-service-api ...................... SUCCESS [  0.720 s]
[INFO] nifi-distributed-cache-client-service-api ......... SUCCESS [  0.741 s]
[INFO] nifi-load-distribution-service-api ................ SUCCESS [  0.650 s]
[INFO] nifi-http-context-map-api ......................... SUCCESS [  0.641 s]
[INFO] nifi-standard-services-api-nar .................... SUCCESS [  0.290 s]
[INFO] nifi-hadoop-libraries-bundle ...................... SUCCESS [  0.040 s]
[INFO] nifi-hadoop-libraries-nar ......................... SUCCESS [  5.223 s]
[INFO] nifi-hadoop-nar ................................... SUCCESS [  0.410 s]
[INFO] nifi-jetty-bundle ................................. SUCCESS [  1.041 s]
[INFO] nifi-persistent-provenance-repository ............. SUCCESS [03:27 min]
[INFO] nifi-provenance-repository-nar .................... SUCCESS [  0.650 s]
[INFO] nifi-distributed-cache-services-bundle ............ SUCCESS [  0.050 s]
[INFO] nifi-distributed-cache-protocol ................... SUCCESS [  0.731 s]
[INFO] nifi-distributed-cache-client-service ............. SUCCESS [  1.331 s]
[INFO] nifi-ssl-context-bundle ........................... SUCCESS [  0.040 s]
[INFO] nifi-ssl-context-service .......................... SUCCESS [  2.363 s]
[INFO] nifi-standard-bundle .............................. SUCCESS [  0.050 s]
[INFO] nifi-standard-processors .......................... SUCCESS [ 38.368 s]
[INFO] nifi-standard-prioritizers ........................ SUCCESS [  1.744 s]
[INFO] nifi-standard-reporting-tasks ..................... SUCCESS [  2.542 s]
[INFO] nifi-standard-nar ................................. SUCCESS [  1.661 s]
[INFO] nifi-distributed-cache-server ..................... SUCCESS [  5.016 s]
[INFO] nifi-distributed-cache-services-nar ............... SUCCESS [  0.380 s]
[INFO] nifi-ssl-context-service-nar ...................... SUCCESS [  0.320 s]
[INFO] nifi-http-context-map-bundle ...................... SUCCESS [  0.040 s]
[INFO] nifi-http-context-map ............................. SUCCESS [  0.921 s]
[INFO] nifi-http-context-map-nar ......................... SUCCESS [  0.311 s]
[INFO] nifi-update-attribute-bundle ...................... SUCCESS [  0.040 s]
[INFO] nifi-update-attribute-model ....................... SUCCESS [  0.840 s]
[INFO] nifi-update-attribute-processor ................... SUCCESS [  2.565 s]
[INFO] nifi-update-attribute-ui .......................... SUCCESS [  2.344 s]
[INFO] nifi-update-attribute-nar ......................... SUCCESS [  0.471 s]
[INFO] nifi-kafka-bundle ................................. SUCCESS [  0.040 s]
[INFO] nifi-kafka-processors ............................. SUCCESS [  3.754 s]
[INFO] nifi-kafka-nar .................................... SUCCESS [  0.951 s]
[INFO] Kite Bundle ....................................... SUCCESS [  0.030 s]
[INFO] Kite Hadoop Processors ............................ FAILURE [  0.980 s]
[INFO] Kite NAR .......................................... SKIPPED
[INFO] nifi-docs ......................................... SKIPPED
[INFO] nifi-assembly ..................................... SKIPPED
[INFO] nifi-maven-archetypes ............................. SKIPPED
[INFO] nifi-processor-bundle-archetype ................... SKIPPED
[INFO] nifi-external ..................................... SKIPPED
[INFO] nifi-spark-receiver ............................... SKIPPED
[INFO] ------------------------------------------------------------------------
[INFO] BUILD FAILURE
[INFO] ------------------------------------------------------------------------
[INFO] Total time: 09:14 min
[INFO] Finished at: 2015-03-09T15:56:48+02:00
[INFO] Final Memory: 105M/591M
[INFO] ------------------------------------------------------------------------
[ERROR] Failed to execute goal on project nifi-kite-processors: Could not resolve dependencies for project org.apache.nifi:nifi-kite-processors:jar:0.0.2-incubating-SNAPSHOT: The following artifacts could not be resolved: org.apache.hbase:hbase-client:jar:0.96.1.1-cdh5.0.0, org.apache.hbase:hbase-server:jar:0.96.1.1-cdh5.0.0, org.apache.hbase:hbase-testing-util:jar:0.96.1.1-cdh5.0.0, org.apache.hive:hive-metastore:jar:0.12.0-cdh5.0.0, org.apache.hive:hive-common:jar:0.12.0-cdh5.0.0, org.apache.hive:hive-serde:jar:0.12.0-cdh5.0.0, org.apache.hive:hive-exec:jar:0.12.0-cdh5.0.0, org.apache.hive:hive-service:jar:0.12.0-cdh5.0.0, org.apache.flume:flume-ng-node:jar:1.4.0-cdh5.0.0: Failure to find org.apache.hbase:hbase-client:jar:0.96.1.1-cdh5.0.0 in http://xxxxxxx:8081/artifactory/repo was cached in the local repository, resolution will not be reattempted until the update interval of livespace has elapsed or updates are forced -> [Help 1]
[ERROR]
[ERROR] To see the full stack trace of the errors, re-run Maven with the -e switch.
[ERROR] Re-run Maven using the -X switch to enable full debug logging.
[ERROR]
[ERROR] For more information about the errors and possible solutions, please read the following articles:
[ERROR] [Help 1] http://cwiki.apache.org/confluence/display/MAVEN/DependencyResolutionException
[ERROR]
[ERROR] After correcting the problems, you can resume the build with the command
[ERROR]   mvn <goals> -rf :nifi-kite-processors
Reply | Threaded
Open this post in threaded view
|

Re: Checkout develop source and nifi-kite-processors can��t find dependencies

Joe Witt
Toivo,

Do you by chance pull in other repos?  As in does your maven settings
indicate to prefer other repos first?  Your build appears to be
pulling in different things than we're seeing.

The CDH stuff you're seeing is my first clue.  We're not pulling that in.

Thanks
Joe

On Mon, Mar 9, 2015 at 10:35 AM, Toivo Adams <[hidden email]> wrote:

> Mark,
>
> Thanks
>
> I did full rebuild from the root ‘nifi’ directory.
> Same problems.
> But for example:
>     Missing artifact org.apache.flume:flume-ng-node:jar:1.4.0-cdh5.0.0
> But as far I understand Maven tries to load this from Maven repo.
> Looking
> http://mvnrepository.com/artifact/org.apache.flume/flume-ng-node/1.4.0
> there is no such version?
>
> It exist in cloudera repo and may be in some other repo
>
> . . .
>
> [INFO]
> ------------------------------------------------------------------------
> [INFO] Building Kite Hadoop Processors 0.0.2-incubating-SNAPSHOT
> [INFO]
> ------------------------------------------------------------------------
> [WARNING] The POM for org.apache.hbase:hbase-client:jar:0.96.1.1-cdh5.0.0 is
> missing, no dependency information available
> [WARNING] The POM for org.apache.hbase:hbase-server:jar:0.96.1.1-cdh5.0.0 is
> missing, no dependency information available
> [WARNING] The POM for
> org.apache.hadoop:hadoop-common:jar:tests:2.3.0-cdh5.0.0 is missing, no
> dependency information available
> [WARNING] The POM for org.apache.hadoop:hadoop-hdfs:jar:tests:2.3.0-cdh5.0.0
> is missing, no dependency information available
> [WARNING] The POM for
> org.apache.hadoop:hadoop-minicluster:jar:2.3.0-cdh5.0.0 is missing, no
> dependency information available
> [WARNING] The POM for
> org.apache.hbase:hbase-testing-util:jar:0.96.1.1-cdh5.0.0 is missing, no
> dependency information available
> [WARNING] The POM for org.apache.hive:hive-metastore:jar:0.12.0-cdh5.0.0 is
> missing, no dependency information available
> [WARNING] The POM for org.apache.hive:hive-common:jar:0.12.0-cdh5.0.0 is
> missing, no dependency information available
> [WARNING] The POM for org.apache.hive:hive-serde:jar:0.12.0-cdh5.0.0 is
> missing, no dependency information available
> [WARNING] The POM for org.apache.hive:hive-exec:jar:0.12.0-cdh5.0.0 is
> missing, no dependency information available
> [WARNING] The POM for org.apache.hive:hive-service:jar:0.12.0-cdh5.0.0 is
> missing, no dependency information available
> [WARNING] The POM for org.apache.flume:flume-ng-node:jar:1.4.0-cdh5.0.0 is
> missing, no dependency information available
> [INFO]
> ------------------------------------------------------------------------
> [INFO] Reactor Summary:
> [INFO]
> [INFO] nifi .............................................. SUCCESS [  2.723
> s]
> [INFO] nifi-api .......................................... SUCCESS [  4.992
> s]
> [INFO] nifi-commons ...................................... SUCCESS [  0.050
> s]
> [INFO] nifi-utils ........................................ SUCCESS [  8.123
> s]
> [INFO] nifi-data-provenance-utils ........................ SUCCESS [  1.101
> s]
> [INFO] nifi-flowfile-packager ............................ SUCCESS [  1.841
> s]
> [INFO] nifi-expression-language .......................... SUCCESS [  8.179
> s]
> [INFO] nifi-logging-utils ................................ SUCCESS [  0.700
> s]
> [INFO] nifi-properties ................................... SUCCESS [  0.813
> s]
> [INFO] nifi-security-utils ............................... SUCCESS [  0.911
> s]
> [INFO] nifi-socket-utils ................................. SUCCESS [  2.221
> s]
> [INFO] nifi-web-utils .................................... SUCCESS [  1.492
> s]
> [INFO] nifi-processor-utils .............................. SUCCESS [  2.100
> s]
> [INFO] nifi-write-ahead-log .............................. SUCCESS [  7.358
> s]
> [INFO] nifi-nar-bundles .................................. SUCCESS [  0.050
> s]
> [INFO] nifi-framework-bundle ............................. SUCCESS [  0.055
> s]
> [INFO] nifi-framework .................................... SUCCESS [  0.051
> s]
> [INFO] nifi-client-dto ................................... SUCCESS [  3.169
> s]
> [INFO] nifi-site-to-site-client .......................... SUCCESS [  3.539
> s]
> [INFO] nifi-bootstrap .................................... SUCCESS [  1.021
> s]
> [INFO] nifi-mock ......................................... SUCCESS [  2.630
> s]
> [INFO] nifi-nar-utils .................................... SUCCESS [  1.107
> s]
> [INFO] nifi-runtime ...................................... SUCCESS [  1.129
> s]
> [INFO] nifi-framework-core-api ........................... SUCCESS [  2.311
> s]
> [INFO] nifi-security ..................................... SUCCESS [  2.316
> s]
> [INFO] nifi-user-actions ................................. SUCCESS [  0.809
> s]
> [INFO] nifi-administration ............................... SUCCESS [  4.979
> s]
> [INFO] nifi-site-to-site ................................. SUCCESS [  3.522
> s]
> [INFO] nifi-framework-cluster-protocol ................... SUCCESS [  8.706
> s]
> [INFO] nifi-framework-core ............................... SUCCESS [01:03
> min]
> [INFO] nifi-web .......................................... SUCCESS [  0.050
> s]
> [INFO] nifi-web-optimistic-locking ....................... SUCCESS [  0.771
> s]
> [INFO] nifi-framework-cluster-web ........................ SUCCESS [  1.171
> s]
> [INFO] nifi-framework-cluster ............................ SUCCESS [ 30.980
> s]
> [INFO] nifi-file-authorization-provider .................. SUCCESS [  2.031
> s]
> [INFO] nifi-cluster-authorization-provider ............... SUCCESS [  2.353
> s]
> [INFO] nifi-custom-ui-utilities .......................... SUCCESS [  0.730
> s]
> [INFO] nifi-web-security ................................. SUCCESS [  4.674
> s]
> [INFO] nifi-provenance-repository-bundle ................. SUCCESS [  0.040
> s]
> [INFO] nifi-volatile-provenance-repository ............... SUCCESS [  2.062
> s]
> [INFO] nifi-web-api ...................................... SUCCESS [ 44.164
> s]
> [INFO] nifi-web-error .................................... SUCCESS [  0.960
> s]
> [INFO] nifi-web-docs ..................................... SUCCESS [  1.091
> s]
> [INFO] nifi-web-ui ....................................... SUCCESS [ 10.967
> s]
> [INFO] nifi-jetty ........................................ SUCCESS [  8.974
> s]
> [INFO] nifi-resources .................................... SUCCESS [  0.800
> s]
> [INFO] nifi-framework-nar ................................ SUCCESS [  3.734
> s]
> [INFO] nifi-hadoop-bundle ................................ SUCCESS [  0.040
> s]
> [INFO] nifi-hdfs-processors .............................. SUCCESS [  7.237
> s]
> [INFO] nifi-standard-services ............................ SUCCESS [  0.040
> s]
> [INFO] nifi-ssl-context-service-api ...................... SUCCESS [  0.720
> s]
> [INFO] nifi-distributed-cache-client-service-api ......... SUCCESS [  0.741
> s]
> [INFO] nifi-load-distribution-service-api ................ SUCCESS [  0.650
> s]
> [INFO] nifi-http-context-map-api ......................... SUCCESS [  0.641
> s]
> [INFO] nifi-standard-services-api-nar .................... SUCCESS [  0.290
> s]
> [INFO] nifi-hadoop-libraries-bundle ...................... SUCCESS [  0.040
> s]
> [INFO] nifi-hadoop-libraries-nar ......................... SUCCESS [  5.223
> s]
> [INFO] nifi-hadoop-nar ................................... SUCCESS [  0.410
> s]
> [INFO] nifi-jetty-bundle ................................. SUCCESS [  1.041
> s]
> [INFO] nifi-persistent-provenance-repository ............. SUCCESS [03:27
> min]
> [INFO] nifi-provenance-repository-nar .................... SUCCESS [  0.650
> s]
> [INFO] nifi-distributed-cache-services-bundle ............ SUCCESS [  0.050
> s]
> [INFO] nifi-distributed-cache-protocol ................... SUCCESS [  0.731
> s]
> [INFO] nifi-distributed-cache-client-service ............. SUCCESS [  1.331
> s]
> [INFO] nifi-ssl-context-bundle ........................... SUCCESS [  0.040
> s]
> [INFO] nifi-ssl-context-service .......................... SUCCESS [  2.363
> s]
> [INFO] nifi-standard-bundle .............................. SUCCESS [  0.050
> s]
> [INFO] nifi-standard-processors .......................... SUCCESS [ 38.368
> s]
> [INFO] nifi-standard-prioritizers ........................ SUCCESS [  1.744
> s]
> [INFO] nifi-standard-reporting-tasks ..................... SUCCESS [  2.542
> s]
> [INFO] nifi-standard-nar ................................. SUCCESS [  1.661
> s]
> [INFO] nifi-distributed-cache-server ..................... SUCCESS [  5.016
> s]
> [INFO] nifi-distributed-cache-services-nar ............... SUCCESS [  0.380
> s]
> [INFO] nifi-ssl-context-service-nar ...................... SUCCESS [  0.320
> s]
> [INFO] nifi-http-context-map-bundle ...................... SUCCESS [  0.040
> s]
> [INFO] nifi-http-context-map ............................. SUCCESS [  0.921
> s]
> [INFO] nifi-http-context-map-nar ......................... SUCCESS [  0.311
> s]
> [INFO] nifi-update-attribute-bundle ...................... SUCCESS [  0.040
> s]
> [INFO] nifi-update-attribute-model ....................... SUCCESS [  0.840
> s]
> [INFO] nifi-update-attribute-processor ................... SUCCESS [  2.565
> s]
> [INFO] nifi-update-attribute-ui .......................... SUCCESS [  2.344
> s]
> [INFO] nifi-update-attribute-nar ......................... SUCCESS [  0.471
> s]
> [INFO] nifi-kafka-bundle ................................. SUCCESS [  0.040
> s]
> [INFO] nifi-kafka-processors ............................. SUCCESS [  3.754
> s]
> [INFO] nifi-kafka-nar .................................... SUCCESS [  0.951
> s]
> [INFO] Kite Bundle ....................................... SUCCESS [  0.030
> s]
> [INFO] Kite Hadoop Processors ............................ FAILURE [  0.980
> s]
> [INFO] Kite NAR .......................................... SKIPPED
> [INFO] nifi-docs ......................................... SKIPPED
> [INFO] nifi-assembly ..................................... SKIPPED
> [INFO] nifi-maven-archetypes ............................. SKIPPED
> [INFO] nifi-processor-bundle-archetype ................... SKIPPED
> [INFO] nifi-external ..................................... SKIPPED
> [INFO] nifi-spark-receiver ............................... SKIPPED
> [INFO]
> ------------------------------------------------------------------------
> [INFO] BUILD FAILURE
> [INFO]
> ------------------------------------------------------------------------
> [INFO] Total time: 09:14 min
> [INFO] Finished at: 2015-03-09T15:56:48+02:00
> [INFO] Final Memory: 105M/591M
> [INFO]
> ------------------------------------------------------------------------
> [ERROR] Failed to execute goal on project nifi-kite-processors: Could not
> resolve dependencies for project
> org.apache.nifi:nifi-kite-processors:jar:0.0.2-incubating-SNAPSHOT: The
> following artifacts could not be resolved:
> org.apache.hbase:hbase-client:jar:0.96.1.1-cdh5.0.0,
> org.apache.hbase:hbase-server:jar:0.96.1.1-cdh5.0.0,
> org.apache.hbase:hbase-testing-util:jar:0.96.1.1-cdh5.0.0,
> org.apache.hive:hive-metastore:jar:0.12.0-cdh5.0.0,
> org.apache.hive:hive-common:jar:0.12.0-cdh5.0.0,
> org.apache.hive:hive-serde:jar:0.12.0-cdh5.0.0,
> org.apache.hive:hive-exec:jar:0.12.0-cdh5.0.0,
> org.apache.hive:hive-service:jar:0.12.0-cdh5.0.0,
> org.apache.flume:flume-ng-node:jar:1.4.0-cdh5.0.0: Failure to find
> org.apache.hbase:hbase-client:jar:0.96.1.1-cdh5.0.0 in
> http://xxxxxxx:8081/artifactory/repo was cached in the local repository,
> resolution will not be reattempted until the update interval of livespace
> has elapsed or updates are forced -> [Help 1]
> [ERROR]
> [ERROR] To see the full stack trace of the errors, re-run Maven with the -e
> switch.
> [ERROR] Re-run Maven using the -X switch to enable full debug logging.
> [ERROR]
> [ERROR] For more information about the errors and possible solutions, please
> read the following articles:
> [ERROR] [Help 1]
> http://cwiki.apache.org/confluence/display/MAVEN/DependencyResolutionException
> [ERROR]
> [ERROR] After correcting the problems, you can resume the build with the
> command
> [ERROR]   mvn <goals> -rf :nifi-kite-processors
>
>
>
>
> --
> View this message in context: http://apache-nifi-incubating-developer-list.39713.n7.nabble.com/Re-Checkout-develop-source-and-nifi-kite-processors-can-t-find-dependencies-tp900p905.html
> Sent from the Apache NiFi (incubating) Developer List mailing list archive at Nabble.com.
Reply | Threaded
Open this post in threaded view
|

Re: Checkout develop source and nifi-kite-processors can��t find dependencies

Toivo Adams
I am not sure I understand, but

/nifi-kite-processors/pom.xml  contain
  <properties>
    <kite.version>0.18.0</kite.version>
    <guava.version>11.0.2</guava.version>
    <junit.version>4.10</junit.version>
    <findbugs-annotations.version>1.3.9-1</findbugs-annotations.version>
  </properties>

. . .

    <dependency>
      <groupId>org.kitesdk</groupId>
      <artifactId>kite-minicluster</artifactId>
      <version>${kite.version}</version>
      <scope>test</scope>
    </dependency>

This leads to

<project xmlns="http://maven.apache.org/POM/4.0.0" xmlns:xsi="http://www.w3.org/2001/XMLSchema-instance" xsi:schemaLocation="http://maven.apache.org/POM/4.0.0 http://maven.apache.org/xsd/maven-4.0.0.xsd">
  <modelVersion>4.0.0</modelVersion>
  <artifactId>kite-minicluster</artifactId>
  <name>Kite Minicluster</name>
  <description />

  <parent>
    <groupId>org.kitesdk</groupId>
    <artifactId>kite-parent</artifactId>
    <version>0.18.0</version>
    <relativePath>../pom.xml</relativePath>
  </parent>

  <properties>
   
    <vers.hive-cdh5>0.12.0-cdh${cdh5.version}</vers.hive-cdh5>
    <vers.flume-cdh5>1.4.0-cdh${cdh5.version}</vers.flume-cdh5>
  </properties>

In Maven repo
http://mvnrepository.com/artifact/org.kitesdk/kite-minicluster/0.18.0
<dependency>
        <groupId>org.kitesdk</groupId>
        <artifactId>kite-minicluster</artifactId>
        <version>0.18.0</version>
</dependency>

Depends on
          org.apache.flume» flume-ng-node    1.4.0-cdh5.0.0
          org.apache.hive» hive-common        0.12.0-cdh5.0.0
           org.apache.hive» hive-exec              0.12.0-cdh5.0.0
          org.apache.hive» hive-metastore     0.12.0-cdh5.0.0
          org.apache.hive» hive-serde           0.12.0-cdh5.0.0
          org.apache.hive» hive-service        0.12.0-cdh5.0.0
          org.kitesdk» kite-data-core            0.18.0
. . .

I am confused

Thanks
Toivo
Reply | Threaded
Open this post in threaded view
|

Re: Checkout develop source and nifi-kite-processors can��t find dependencies

Joe Witt
Toivo

Ah ok - sorry didn't pay attention to the tests.  I was able to find
all of those items without any problem.  Perhaps try building with all
the debug voodoo that maven can offer so we can see more about the
repositories being used?

But it does appear related to the artifactory config.

Thanks
joe

On Mon, Mar 9, 2015 at 11:38 AM, Toivo Adams <[hidden email]> wrote:

> I am not sure I understand, but
>
> /nifi-kite-processors/pom.xml  contain
>   <properties>
>     <kite.version>0.18.0</kite.version>
>     <guava.version>11.0.2</guava.version>
>     <junit.version>4.10</junit.version>
>     <findbugs-annotations.version>1.3.9-1</findbugs-annotations.version>
>   </properties>
>
> . . .
>
>     <dependency>
>       <groupId>org.kitesdk</groupId>
>       <artifactId>kite-minicluster</artifactId>
>       <version>${kite.version}</version>
>       <scope>test</scope>
>     </dependency>
>
> This leads to
>
> <project xmlns="http://maven.apache.org/POM/4.0.0"
> xmlns:xsi="http://www.w3.org/2001/XMLSchema-instance"
> xsi:schemaLocation="http://maven.apache.org/POM/4.0.0
> http://maven.apache.org/xsd/maven-4.0.0.xsd">
>   <modelVersion>4.0.0</modelVersion>
>   <artifactId>kite-minicluster</artifactId>
>   <name>Kite Minicluster</name>
>   <description />
>
>   <parent>
>     <groupId>org.kitesdk</groupId>
>     <artifactId>kite-parent</artifactId>
>     <version>0.18.0</version>
>     <relativePath>../pom.xml</relativePath>
>   </parent>
>
>   <properties>
>
>     <vers.hive-cdh5>0.12.0-cdh${cdh5.version}</vers.hive-cdh5>
>     <vers.flume-cdh5>1.4.0-cdh${cdh5.version}</vers.flume-cdh5>
>   </properties>
>
> In Maven repo
> http://mvnrepository.com/artifact/org.kitesdk/kite-minicluster/0.18.0
> <dependency>
>         <groupId>org.kitesdk</groupId>
>         <artifactId>kite-minicluster</artifactId>
>         <version>0.18.0</version>
> </dependency>
>
> Depends on
>                 org.apache.flume» flume-ng-node    1.4.0-cdh5.0.0
>                 org.apache.hive» hive-common        0.12.0-cdh5.0.0
>                 org.apache.hive» hive-exec              0.12.0-cdh5.0.0
>                 org.apache.hive» hive-metastore     0.12.0-cdh5.0.0
>                 org.apache.hive» hive-serde           0.12.0-cdh5.0.0
>                 org.apache.hive» hive-service        0.12.0-cdh5.0.0
>                 org.kitesdk» kite-data-core            0.18.0
> . . .
>
> I am confused
>
> Thanks
> Toivo
>
>
>
>
> --
> View this message in context: http://apache-nifi-incubating-developer-list.39713.n7.nabble.com/Re-Checkout-develop-source-and-nifi-kite-processors-can-t-find-dependencies-tp900p908.html
> Sent from the Apache NiFi (incubating) Developer List mailing list archive at Nabble.com.
Reply | Threaded
Open this post in threaded view
|

Re: Checkout develop source and nifi-kite-processors can��t find dependencies

Sean Busbey
the kite-parent that shows up in the maven central repository adds several
repositories[1] to check for its dependencies.

Can you verify that the one you get from mvnrepository.com also does?

Can you pastebin the output of your maven command so we can see if maven is
attempting to get to the add-on repositories?

What version of maven are you using?

Have you set up a local repository mirror setting that is meant to act as a
substitute for all repositories[2]?


[1]:
https://repo1.maven.org/maven2/org/kitesdk/kite-parent/0.18.0/kite-parent-0.18.0.pom
[2]:
http://maven.apache.org/guides/mini/guide-mirror-settings.html#Using_A_Single_Repository

On Mon, Mar 9, 2015 at 10:53 AM, Joe Witt <[hidden email]> wrote:

> Toivo
>
> Ah ok - sorry didn't pay attention to the tests.  I was able to find
> all of those items without any problem.  Perhaps try building with all
> the debug voodoo that maven can offer so we can see more about the
> repositories being used?
>
> But it does appear related to the artifactory config.
>
> Thanks
> joe
>
> On Mon, Mar 9, 2015 at 11:38 AM, Toivo Adams <[hidden email]>
> wrote:
> > I am not sure I understand, but
> >
> > /nifi-kite-processors/pom.xml  contain
> >   <properties>
> >     <kite.version>0.18.0</kite.version>
> >     <guava.version>11.0.2</guava.version>
> >     <junit.version>4.10</junit.version>
> >     <findbugs-annotations.version>1.3.9-1</findbugs-annotations.version>
> >   </properties>
> >
> > . . .
> >
> >     <dependency>
> >       <groupId>org.kitesdk</groupId>
> >       <artifactId>kite-minicluster</artifactId>
> >       <version>${kite.version}</version>
> >       <scope>test</scope>
> >     </dependency>
> >
> > This leads to
> >
> > <project xmlns="http://maven.apache.org/POM/4.0.0"
> > xmlns:xsi="http://www.w3.org/2001/XMLSchema-instance"
> > xsi:schemaLocation="http://maven.apache.org/POM/4.0.0
> > http://maven.apache.org/xsd/maven-4.0.0.xsd">
> >   <modelVersion>4.0.0</modelVersion>
> >   <artifactId>kite-minicluster</artifactId>
> >   <name>Kite Minicluster</name>
> >   <description />
> >
> >   <parent>
> >     <groupId>org.kitesdk</groupId>
> >     <artifactId>kite-parent</artifactId>
> >     <version>0.18.0</version>
> >     <relativePath>../pom.xml</relativePath>
> >   </parent>
> >
> >   <properties>
> >
> >     <vers.hive-cdh5>0.12.0-cdh${cdh5.version}</vers.hive-cdh5>
> >     <vers.flume-cdh5>1.4.0-cdh${cdh5.version}</vers.flume-cdh5>
> >   </properties>
> >
> > In Maven repo
> > http://mvnrepository.com/artifact/org.kitesdk/kite-minicluster/0.18.0
> > <dependency>
> >         <groupId>org.kitesdk</groupId>
> >         <artifactId>kite-minicluster</artifactId>
> >         <version>0.18.0</version>
> > </dependency>
> >
> > Depends on
> >                 org.apache.flume» flume-ng-node    1.4.0-cdh5.0.0
> >                 org.apache.hive» hive-common        0.12.0-cdh5.0.0
> >                 org.apache.hive» hive-exec              0.12.0-cdh5.0.0
> >                 org.apache.hive» hive-metastore     0.12.0-cdh5.0.0
> >                 org.apache.hive» hive-serde           0.12.0-cdh5.0.0
> >                 org.apache.hive» hive-service        0.12.0-cdh5.0.0
> >                 org.kitesdk» kite-data-core            0.18.0
> > . . .
> >
> > I am confused
> >
> > Thanks
> > Toivo
> >
> >
> >
> >
> > --
> > View this message in context:
> http://apache-nifi-incubating-developer-list.39713.n7.nabble.com/Re-Checkout-develop-source-and-nifi-kite-processors-can-t-find-dependencies-tp900p908.html
> > Sent from the Apache NiFi (incubating) Developer List mailing list
> archive at Nabble.com.
>



--
Sean
Reply | Threaded
Open this post in threaded view
|

Re: Checkout develop source and nifi-kite-processors can��t find dependencies

Toivo Adams
I am behind a corporate firewall and mirror in Maven settings.xml was not able to access to required repo’s.
After some modifications in settings.xml problem is solved.


Thank you all!
Toivo