[VOTE] Release Apache NiFi 1.1.0 (RC2)

classic Classic list List threaded Threaded
24 messages Options
12
Reply | Threaded
Open this post in threaded view
|

[VOTE] Release Apache NiFi 1.1.0 (RC2)

joewitt
Administrator
Hello Apache NiFi Community,

I am pleased to be calling this vote for the source release of Apache NiFi,
nifi-1.1.0.

The source release zip and convenience binaries, including signatures
and digests can be found at:
  https://dist.apache.org/repos/dist/dev/nifi/1.0.0-rc2/

The Git tag is nifi-1.1.0-RC2
The Git commit hash is f61e42c65e1c2387591ee368c2148cd5bda646bd
* https://git-wip-us.apache.org/repos/asf?p=nifi.git;a=commit;h=f61e42c65e1c2387591ee368c2148cd5bda646bd
* https://github.com/apache/nifi/commit/f61e42c65e1c2387591ee368c2148cd5bda646bd

Checksums of nifi-1.1.0-source-release.zip:
MD5: 371fb856d9c3947603239ea98f171f6f
SHA1: 532c2e14e915dfa522254745bbc068aa6620babb
SHA256: dd1d0569f209fd7f179b85a50fe4bf81b3d850c79b13d32cad88982a8234a719

Release artifacts are signed with the following key:
  https://people.apache.org/keys/committer/joewitt

KEYS file available here:
  https://dist.apache.org/repos/dist/release/nifi/KEYS

268 issues were closed/resolved for this release:
  https://issues.apache.org/jira/secure/ReleaseNote.jspa?projectId=12316020&version=12337875


Release note highlights can be found here:
  https://cwiki.apache.org/confluence/display/NIFI/Release+Notes#ReleaseNotes-Version1.1.0

The vote will be open for 72 hours.
Please download the release candidate and evaluate the necessary items
including checking hashes, signatures, build from source, and test. Then
please vote:

[ ] +1 Release this package as nifi-1.1.0
[ ] +0 no opinion
[ ] -1 Do not release this package because...

Thanks!
Reply | Threaded
Open this post in threaded view
|

Re: [VOTE] Release Apache NiFi 1.1.0 (RC2)

joewitt
Administrator
+1 (binding).

Verified the primary finding from RC1 was addressed.
Verified the finding with RAT completion on windows from RC1 was addressed.
Verified the test timeout issue was improved.

Built using a full clean build with contrib check successfully on OSX,
Linux, and Windows 10.
Built using a parallel build successfully on OSX, Linux, and logged a
JIRA for a test failure on Windows 10.

Tested application behavior on each system (osx, linux, windows 10)
using Chrome, Firefox, and MS Edge.

Thanks
Joe

On Sat, Nov 26, 2016 at 1:11 AM, Joe Witt <[hidden email]> wrote:

> Hello Apache NiFi Community,
>
> I am pleased to be calling this vote for the source release of Apache NiFi,
> nifi-1.1.0.
>
> The source release zip and convenience binaries, including signatures
> and digests can be found at:
>   https://dist.apache.org/repos/dist/dev/nifi/1.0.0-rc2/
>
> The Git tag is nifi-1.1.0-RC2
> The Git commit hash is f61e42c65e1c2387591ee368c2148cd5bda646bd
> * https://git-wip-us.apache.org/repos/asf?p=nifi.git;a=commit;h=f61e42c65e1c2387591ee368c2148cd5bda646bd
> * https://github.com/apache/nifi/commit/f61e42c65e1c2387591ee368c2148cd5bda646bd
>
> Checksums of nifi-1.1.0-source-release.zip:
> MD5: 371fb856d9c3947603239ea98f171f6f
> SHA1: 532c2e14e915dfa522254745bbc068aa6620babb
> SHA256: dd1d0569f209fd7f179b85a50fe4bf81b3d850c79b13d32cad88982a8234a719
>
> Release artifacts are signed with the following key:
>   https://people.apache.org/keys/committer/joewitt
>
> KEYS file available here:
>   https://dist.apache.org/repos/dist/release/nifi/KEYS
>
> 268 issues were closed/resolved for this release:
>   https://issues.apache.org/jira/secure/ReleaseNote.jspa?projectId=12316020&version=12337875
>
>
> Release note highlights can be found here:
>   https://cwiki.apache.org/confluence/display/NIFI/Release+Notes#ReleaseNotes-Version1.1.0
>
> The vote will be open for 72 hours.
> Please download the release candidate and evaluate the necessary items
> including checking hashes, signatures, build from source, and test. Then
> please vote:
>
> [ ] +1 Release this package as nifi-1.1.0
> [ ] +0 no opinion
> [ ] -1 Do not release this package because...
>
> Thanks!
Reply | Threaded
Open this post in threaded view
|

Re: [VOTE] Release Apache NiFi 1.1.0 (RC2)

Joey Frazee
+1 (non-binding)

- Verified signatures, checksums, commit ID, LICENSE and NOTICE
- Successfully ran mvn -T 2.0C clean install -Pcontrib-check on OSX 10.11.6 w/ Oracle Java 1.8.0_112 and empty .m2 repo
- Successfully ran mvn -T 2.0C clean install -Pcontrib-check on Amazon Linux 2016.09.0 w/ OpenJDK 1.8.0_111 and empty .m2 repo
- Built RPM with mvn -T 2.0C clean install -DskipTests -Prpm
- Tested RPM install
- Ran a variety of data flows (incl. ExecuteScript, TransformXml, ExtractHL7Attributes, Publish/ConsumeKafka among others)
- Tested back pressure indicators
-joey

On Nov 26, 2016, at 12:14 AM, Joe Witt <[hidden email]> wrote:

+1 (binding).

Verified the primary finding from RC1 was addressed.
Verified the finding with RAT completion on windows from RC1 was addressed.
Verified the test timeout issue was improved.

Built using a full clean build with contrib check successfully on OSX,
Linux, and Windows 10.
Built using a parallel build successfully on OSX, Linux, and logged a
JIRA for a test failure on Windows 10.

Tested application behavior on each system (osx, linux, windows 10)
using Chrome, Firefox, and MS Edge.

Thanks
Joe

On Sat, Nov 26, 2016 at 1:11 AM, Joe Witt <[hidden email]> wrote:
Hello Apache NiFi Community,

I am pleased to be calling this vote for the source release of Apache NiFi,
nifi-1.1.0.

The source release zip and convenience binaries, including signatures
and digests can be found at:
https://dist.apache.org/repos/dist/dev/nifi/1.0.0-rc2/

The Git tag is nifi-1.1.0-RC2
The Git commit hash is f61e42c65e1c2387591ee368c2148cd5bda646bd
* https://git-wip-us.apache.org/repos/asf?p=nifi.git;a=commit;h=f61e42c65e1c2387591ee368c2148cd5bda646bd
* https://github.com/apache/nifi/commit/f61e42c65e1c2387591ee368c2148cd5bda646bd

Checksums of nifi-1.1.0-source-release.zip:
MD5: 371fb856d9c3947603239ea98f171f6f
SHA1: 532c2e14e915dfa522254745bbc068aa6620babb
SHA256: dd1d0569f209fd7f179b85a50fe4bf81b3d850c79b13d32cad88982a8234a719

Release artifacts are signed with the following key:
https://people.apache.org/keys/committer/joewitt

KEYS file available here:
https://dist.apache.org/repos/dist/release/nifi/KEYS

268 issues were closed/resolved for this release:
https://issues.apache.org/jira/secure/ReleaseNote.jspa?projectId=12316020&version=12337875


Release note highlights can be found here:
https://cwiki.apache.org/confluence/display/NIFI/Release+Notes#ReleaseNotes-Version1.1.0

The vote will be open for 72 hours.
Please download the release candidate and evaluate the necessary items
including checking hashes, signatures, build from source, and test. Then
please vote:

[ ] +1 Release this package as nifi-1.1.0
[ ] +0 no opinion
[ ] -1 Do not release this package because...

Thanks!
Reply | Threaded
Open this post in threaded view
|

Re: [VOTE] Release Apache NiFi 1.1.0 (RC2)

Aldrin Piri
In reply to this post by joewitt
+1, binding

Hashes and signatures looked good.
Contrib passed
Builds and functionality were okay on OS X and Linux.

I could not get a successful build on Windows 10 without removing some
tests.  I ran into the item covered in
https://issues.apache.org/jira/browse/NIFI-2692 from the 1.0 release as
well as the following in TestInvokeJavascript.  This was with JDK
1.8.0u77.  Will create a ticket to capture but was not reproducible in any
other environments inclusive of a Windows 7 VM.  Removing those tests
produced a working build in Windows 10.

[main] INFO org.apache.nifi.processors.script.InvokeScriptedProcessor -
InvokeScriptedProcessor[id=11fe6a03-cb69-4b78-8b74-b16eeacc3710] logger is
set! logger=org.apache.nifi.util.MockComponentLog@645aa696
[main] ERROR org.apache.nifi.processors.script.InvokeScriptedProcessor -
[InvokeScriptedProcessor[id=11fe6a03-cb69-4b78-8b74-b16eeacc3710]] Unable
to validate the script Processor: java.lang.ClassCastException: Cannot cast
jdk.nashorn.internal.objects.NativeArray to java.util.Collection
java.lang.ClassCastException: Cannot cast
jdk.nashorn.internal.objects.NativeArray
to java.util.Collection
at java.lang.invoke.MethodHandleImpl.newClassCastException(
MethodHandleImpl.java:361)
at java.lang.invoke.MethodHandleImpl.castReference(
MethodHandleImpl.java:356)
at org.apache.nifi.processor.Processor$$NashornJavaAdapter.validate(Unknown
Source)
at org.apache.nifi.processors.script.InvokeScriptedProcessor.customValidate(
InvokeScriptedProcessor.java:464)
at org.apache.nifi.components.AbstractConfigurableComponent.validate(
AbstractConfigurableComponent.java:126)
at org.apache.nifi.util.MockProcessContext.validate(
MockProcessContext.java:226)
at org.apache.nifi.util.MockProcessContext.assertValid(
MockProcessContext.java:243)
at org.apache.nifi.util.StandardProcessorTestRunner.assertValid(
StandardProcessorTestRunner.java:334)
at org.apache.nifi.processors.script.TestInvokeJavascript.
testReadFlowFileContentAndStoreInFlowFileAttribute(
TestInvokeJavascript.java:59)
at sun.reflect.NativeMethodAccessorImpl.invoke0(Native Method)
at sun.reflect.NativeMethodAccessorImpl.invoke(
NativeMethodAccessorImpl.java:62)
at sun.reflect.DelegatingMethodAccessorImpl.invoke(
DelegatingMethodAccessorImpl.java:43)
at java.lang.reflect.Method.invoke(Method.java:497)
at org.junit.runners.model.FrameworkMethod$1.runReflectiveCall(
FrameworkMethod.java:50)
at org.junit.internal.runners.model.ReflectiveCallable.run(
ReflectiveCallable.java:12)
at org.junit.runners.model.FrameworkMethod.invokeExplosively(
FrameworkMethod.java:47)
at org.junit.internal.runners.statements.InvokeMethod.
evaluate(InvokeMethod.java:17)
at org.junit.internal.runners.statements.RunBefores.
evaluate(RunBefores.java:26)
at org.junit.runners.ParentRunner.runLeaf(ParentRunner.java:325)
at org.junit.runners.BlockJUnit4ClassRunner.runChild(
BlockJUnit4ClassRunner.java:78)
at org.junit.runners.BlockJUnit4ClassRunner.runChild(
BlockJUnit4ClassRunner.java:57)
at org.junit.runners.ParentRunner$3.run(ParentRunner.java:290)
at org.junit.runners.ParentRunner$1.schedule(ParentRunner.java:71)
at org.junit.runners.ParentRunner.runChildren(ParentRunner.java:288)
at org.junit.runners.ParentRunner.access$000(ParentRunner.java:58)
at org.junit.runners.ParentRunner$2.evaluate(ParentRunner.java:268)
at org.junit.internal.runners.statements.RunBefores.
evaluate(RunBefores.java:26)
at org.junit.runners.ParentRunner.run(ParentRunner.java:363)
at org.junit.runner.JUnitCore.run(JUnitCore.java:137)
at com.intellij.junit4.JUnit4IdeaTestRunner.startRunnerWithArgs(
JUnit4IdeaTestRunner.java:78)
at com.intellij.rt.execution.junit.JUnitStarter.prepareStreamsAndStart(
JUnitStarter.java:212)
at com.intellij.rt.execution.junit.JUnitStarter.main(JUnitStarter.java:68)
at sun.reflect.NativeMethodAccessorImpl.invoke0(Native Method)
at sun.reflect.NativeMethodAccessorImpl.invoke(
NativeMethodAccessorImpl.java:62)
at sun.reflect.DelegatingMethodAccessorImpl.invoke(
DelegatingMethodAccessorImpl.java:43)
at java.lang.reflect.Method.invoke(Method.java:497)
at com.intellij.rt.execution.application.AppMain.main(AppMain.java:140)

java.lang.AssertionError: Processor has 1 validation failures:
'Validation' validated against
'target/test/resources/javascript/test_reader.js'
is invalid because An error occurred calling validate in the configured
script Processor.

at org.junit.Assert.fail(Assert.java:88)
at org.apache.nifi.util.MockProcessContext.assertValid(
MockProcessContext.java:251)
at org.apache.nifi.util.StandardProcessorTestRunner.assertValid(
StandardProcessorTestRunner.java:334)
at org.apache.nifi.processors.script.TestInvokeJavascript.
testReadFlowFileContentAndStoreInFlowFileAttribute(
TestInvokeJavascript.java:59)
at sun.reflect.NativeMethodAccessorImpl.invoke0(Native Method)
at sun.reflect.NativeMethodAccessorImpl.invoke(
NativeMethodAccessorImpl.java:62)
at sun.reflect.DelegatingMethodAccessorImpl.invoke(
DelegatingMethodAccessorImpl.java:43)
at org.junit.runners.model.FrameworkMethod$1.runReflectiveCall(
FrameworkMethod.java:50)
at org.junit.internal.runners.model.ReflectiveCallable.run(
ReflectiveCallable.java:12)
at org.junit.runners.model.FrameworkMethod.invokeExplosively(
FrameworkMethod.java:47)
at org.junit.internal.runners.statements.InvokeMethod.
evaluate(InvokeMethod.java:17)
at org.junit.internal.runners.statements.RunBefores.
evaluate(RunBefores.java:26)
at org.junit.runners.ParentRunner.runLeaf(ParentRunner.java:325)
at org.junit.runners.BlockJUnit4ClassRunner.runChild(
BlockJUnit4ClassRunner.java:78)
at org.junit.runners.BlockJUnit4ClassRunner.runChild(
BlockJUnit4ClassRunner.java:57)
at org.junit.runners.ParentRunner$3.run(ParentRunner.java:290)
at org.junit.runners.ParentRunner$1.schedule(ParentRunner.java:71)
at org.junit.runners.ParentRunner.runChildren(ParentRunner.java:288)
at org.junit.runners.ParentRunner.access$000(ParentRunner.java:58)
at org.junit.runners.ParentRunner$2.evaluate(ParentRunner.java:268)
at org.junit.internal.runners.statements.RunBefores.
evaluate(RunBefores.java:26)
at org.junit.runners.ParentRunner.run(ParentRunner.java:363)
at org.junit.runner.JUnitCore.run(JUnitCore.java:137)
at com.intellij.junit4.JUnit4IdeaTestRunner.startRunnerWithArgs(
JUnit4IdeaTestRunner.java:78)
at com.intellij.rt.execution.junit.JUnitStarter.prepareStreamsAndStart(
JUnitStarter.java:212)
at com.intellij.rt.execution.junit.JUnitStarter.main(JUnitStarter.java:68)
at sun.reflect.NativeMethodAccessorImpl.invoke0(Native Method)
at sun.reflect.NativeMethodAccessorImpl.invoke(
NativeMethodAccessorImpl.java:62)
at com.intellij.rt.execution.application.AppMain.main(AppMain.java:140)


Process finished with exit code -1


On Sat, Nov 26, 2016 at 1:14 AM, Joe Witt <[hidden email]> wrote:

> +1 (binding).
>
> Verified the primary finding from RC1 was addressed.
> Verified the finding with RAT completion on windows from RC1 was addressed.
> Verified the test timeout issue was improved.
>
> Built using a full clean build with contrib check successfully on OSX,
> Linux, and Windows 10.
> Built using a parallel build successfully on OSX, Linux, and logged a
> JIRA for a test failure on Windows 10.
>
> Tested application behavior on each system (osx, linux, windows 10)
> using Chrome, Firefox, and MS Edge.
>
> Thanks
> Joe
>
> On Sat, Nov 26, 2016 at 1:11 AM, Joe Witt <[hidden email]> wrote:
> > Hello Apache NiFi Community,
> >
> > I am pleased to be calling this vote for the source release of Apache
> NiFi,
> > nifi-1.1.0.
> >
> > The source release zip and convenience binaries, including signatures
> > and digests can be found at:
> >   https://dist.apache.org/repos/dist/dev/nifi/1.0.0-rc2/
> >
> > The Git tag is nifi-1.1.0-RC2
> > The Git commit hash is f61e42c65e1c2387591ee368c2148cd5bda646bd
> > * https://git-wip-us.apache.org/repos/asf?p=nifi.git;a=commit;
> h=f61e42c65e1c2387591ee368c2148cd5bda646bd
> > * https://github.com/apache/nifi/commit/f61e42c65e1c2387591ee3
> 68c2148cd5bda646bd
> >
> > Checksums of nifi-1.1.0-source-release.zip:
> > MD5: 371fb856d9c3947603239ea98f171f6f
> > SHA1: 532c2e14e915dfa522254745bbc068aa6620babb
> > SHA256: dd1d0569f209fd7f179b85a50fe4bf81b3d850c79b13d32cad88982a8234a719
> >
> > Release artifacts are signed with the following key:
> >   https://people.apache.org/keys/committer/joewitt
> >
> > KEYS file available here:
> >   https://dist.apache.org/repos/dist/release/nifi/KEYS
> >
> > 268 issues were closed/resolved for this release:
> >   https://issues.apache.org/jira/secure/ReleaseNote.jspa?proj
> ectId=12316020&version=12337875
> >
> >
> > Release note highlights can be found here:
> >   https://cwiki.apache.org/confluence/display/NIFI/Release+No
> tes#ReleaseNotes-Version1.1.0
> >
> > The vote will be open for 72 hours.
> > Please download the release candidate and evaluate the necessary items
> > including checking hashes, signatures, build from source, and test. Then
> > please vote:
> >
> > [ ] +1 Release this package as nifi-1.1.0
> > [ ] +0 no opinion
> > [ ] -1 Do not release this package because...
> >
> > Thanks!
>
Reply | Threaded
Open this post in threaded view
|

Re: [VOTE] Release Apache NiFi 1.1.0 (RC2)

trkurc
Administrator
Odd, I am still verifying the release, but I was able to build without
issue on Windows 10. Using Oracle java 1.8.0_91 and Apache maven 3.3.3

On Nov 27, 2016 5:14 PM, "Aldrin Piri" <[hidden email]> wrote:

> +1, binding
>
> Hashes and signatures looked good.
> Contrib passed
> Builds and functionality were okay on OS X and Linux.
>
> I could not get a successful build on Windows 10 without removing some
> tests.  I ran into the item covered in
> https://issues.apache.org/jira/browse/NIFI-2692 from the 1.0 release as
> well as the following in TestInvokeJavascript.  This was with JDK
> 1.8.0u77.  Will create a ticket to capture but was not reproducible in any
> other environments inclusive of a Windows 7 VM.  Removing those tests
> produced a working build in Windows 10.
>
> [main] INFO org.apache.nifi.processors.script.InvokeScriptedProcessor -
> InvokeScriptedProcessor[id=11fe6a03-cb69-4b78-8b74-b16eeacc3710] logger is
> set! logger=org.apache.nifi.util.MockComponentLog@645aa696
> [main] ERROR org.apache.nifi.processors.script.InvokeScriptedProcessor -
> [InvokeScriptedProcessor[id=11fe6a03-cb69-4b78-8b74-b16eeacc3710]] Unable
> to validate the script Processor: java.lang.ClassCastException: Cannot cast
> jdk.nashorn.internal.objects.NativeArray to java.util.Collection
> java.lang.ClassCastException: Cannot cast
> jdk.nashorn.internal.objects.NativeArray
> to java.util.Collection
> at java.lang.invoke.MethodHandleImpl.newClassCastException(
> MethodHandleImpl.java:361)
> at java.lang.invoke.MethodHandleImpl.castReference(
> MethodHandleImpl.java:356)
> at org.apache.nifi.processor.Processor$$NashornJavaAdapter.
> validate(Unknown
> Source)
> at org.apache.nifi.processors.script.InvokeScriptedProcessor.
> customValidate(
> InvokeScriptedProcessor.java:464)
> at org.apache.nifi.components.AbstractConfigurableComponent.validate(
> AbstractConfigurableComponent.java:126)
> at org.apache.nifi.util.MockProcessContext.validate(
> MockProcessContext.java:226)
> at org.apache.nifi.util.MockProcessContext.assertValid(
> MockProcessContext.java:243)
> at org.apache.nifi.util.StandardProcessorTestRunner.assertValid(
> StandardProcessorTestRunner.java:334)
> at org.apache.nifi.processors.script.TestInvokeJavascript.
> testReadFlowFileContentAndStoreInFlowFileAttribute(
> TestInvokeJavascript.java:59)
> at sun.reflect.NativeMethodAccessorImpl.invoke0(Native Method)
> at sun.reflect.NativeMethodAccessorImpl.invoke(
> NativeMethodAccessorImpl.java:62)
> at sun.reflect.DelegatingMethodAccessorImpl.invoke(
> DelegatingMethodAccessorImpl.java:43)
> at java.lang.reflect.Method.invoke(Method.java:497)
> at org.junit.runners.model.FrameworkMethod$1.runReflectiveCall(
> FrameworkMethod.java:50)
> at org.junit.internal.runners.model.ReflectiveCallable.run(
> ReflectiveCallable.java:12)
> at org.junit.runners.model.FrameworkMethod.invokeExplosively(
> FrameworkMethod.java:47)
> at org.junit.internal.runners.statements.InvokeMethod.
> evaluate(InvokeMethod.java:17)
> at org.junit.internal.runners.statements.RunBefores.
> evaluate(RunBefores.java:26)
> at org.junit.runners.ParentRunner.runLeaf(ParentRunner.java:325)
> at org.junit.runners.BlockJUnit4ClassRunner.runChild(
> BlockJUnit4ClassRunner.java:78)
> at org.junit.runners.BlockJUnit4ClassRunner.runChild(
> BlockJUnit4ClassRunner.java:57)
> at org.junit.runners.ParentRunner$3.run(ParentRunner.java:290)
> at org.junit.runners.ParentRunner$1.schedule(ParentRunner.java:71)
> at org.junit.runners.ParentRunner.runChildren(ParentRunner.java:288)
> at org.junit.runners.ParentRunner.access$000(ParentRunner.java:58)
> at org.junit.runners.ParentRunner$2.evaluate(ParentRunner.java:268)
> at org.junit.internal.runners.statements.RunBefores.
> evaluate(RunBefores.java:26)
> at org.junit.runners.ParentRunner.run(ParentRunner.java:363)
> at org.junit.runner.JUnitCore.run(JUnitCore.java:137)
> at com.intellij.junit4.JUnit4IdeaTestRunner.startRunnerWithArgs(
> JUnit4IdeaTestRunner.java:78)
> at com.intellij.rt.execution.junit.JUnitStarter.prepareStreamsAndStart(
> JUnitStarter.java:212)
> at com.intellij.rt.execution.junit.JUnitStarter.main(JUnitStarter.java:68)
> at sun.reflect.NativeMethodAccessorImpl.invoke0(Native Method)
> at sun.reflect.NativeMethodAccessorImpl.invoke(
> NativeMethodAccessorImpl.java:62)
> at sun.reflect.DelegatingMethodAccessorImpl.invoke(
> DelegatingMethodAccessorImpl.java:43)
> at java.lang.reflect.Method.invoke(Method.java:497)
> at com.intellij.rt.execution.application.AppMain.main(AppMain.java:140)
>
> java.lang.AssertionError: Processor has 1 validation failures:
> 'Validation' validated against
> 'target/test/resources/javascript/test_reader.js'
> is invalid because An error occurred calling validate in the configured
> script Processor.
>
> at org.junit.Assert.fail(Assert.java:88)
> at org.apache.nifi.util.MockProcessContext.assertValid(
> MockProcessContext.java:251)
> at org.apache.nifi.util.StandardProcessorTestRunner.assertValid(
> StandardProcessorTestRunner.java:334)
> at org.apache.nifi.processors.script.TestInvokeJavascript.
> testReadFlowFileContentAndStoreInFlowFileAttribute(
> TestInvokeJavascript.java:59)
> at sun.reflect.NativeMethodAccessorImpl.invoke0(Native Method)
> at sun.reflect.NativeMethodAccessorImpl.invoke(
> NativeMethodAccessorImpl.java:62)
> at sun.reflect.DelegatingMethodAccessorImpl.invoke(
> DelegatingMethodAccessorImpl.java:43)
> at org.junit.runners.model.FrameworkMethod$1.runReflectiveCall(
> FrameworkMethod.java:50)
> at org.junit.internal.runners.model.ReflectiveCallable.run(
> ReflectiveCallable.java:12)
> at org.junit.runners.model.FrameworkMethod.invokeExplosively(
> FrameworkMethod.java:47)
> at org.junit.internal.runners.statements.InvokeMethod.
> evaluate(InvokeMethod.java:17)
> at org.junit.internal.runners.statements.RunBefores.
> evaluate(RunBefores.java:26)
> at org.junit.runners.ParentRunner.runLeaf(ParentRunner.java:325)
> at org.junit.runners.BlockJUnit4ClassRunner.runChild(
> BlockJUnit4ClassRunner.java:78)
> at org.junit.runners.BlockJUnit4ClassRunner.runChild(
> BlockJUnit4ClassRunner.java:57)
> at org.junit.runners.ParentRunner$3.run(ParentRunner.java:290)
> at org.junit.runners.ParentRunner$1.schedule(ParentRunner.java:71)
> at org.junit.runners.ParentRunner.runChildren(ParentRunner.java:288)
> at org.junit.runners.ParentRunner.access$000(ParentRunner.java:58)
> at org.junit.runners.ParentRunner$2.evaluate(ParentRunner.java:268)
> at org.junit.internal.runners.statements.RunBefores.
> evaluate(RunBefores.java:26)
> at org.junit.runners.ParentRunner.run(ParentRunner.java:363)
> at org.junit.runner.JUnitCore.run(JUnitCore.java:137)
> at com.intellij.junit4.JUnit4IdeaTestRunner.startRunnerWithArgs(
> JUnit4IdeaTestRunner.java:78)
> at com.intellij.rt.execution.junit.JUnitStarter.prepareStreamsAndStart(
> JUnitStarter.java:212)
> at com.intellij.rt.execution.junit.JUnitStarter.main(JUnitStarter.java:68)
> at sun.reflect.NativeMethodAccessorImpl.invoke0(Native Method)
> at sun.reflect.NativeMethodAccessorImpl.invoke(
> NativeMethodAccessorImpl.java:62)
> at com.intellij.rt.execution.application.AppMain.main(AppMain.java:140)
>
>
> Process finished with exit code -1
>
>
> On Sat, Nov 26, 2016 at 1:14 AM, Joe Witt <[hidden email]> wrote:
>
> > +1 (binding).
> >
> > Verified the primary finding from RC1 was addressed.
> > Verified the finding with RAT completion on windows from RC1 was
> addressed.
> > Verified the test timeout issue was improved.
> >
> > Built using a full clean build with contrib check successfully on OSX,
> > Linux, and Windows 10.
> > Built using a parallel build successfully on OSX, Linux, and logged a
> > JIRA for a test failure on Windows 10.
> >
> > Tested application behavior on each system (osx, linux, windows 10)
> > using Chrome, Firefox, and MS Edge.
> >
> > Thanks
> > Joe
> >
> > On Sat, Nov 26, 2016 at 1:11 AM, Joe Witt <[hidden email]> wrote:
> > > Hello Apache NiFi Community,
> > >
> > > I am pleased to be calling this vote for the source release of Apache
> > NiFi,
> > > nifi-1.1.0.
> > >
> > > The source release zip and convenience binaries, including signatures
> > > and digests can be found at:
> > >   https://dist.apache.org/repos/dist/dev/nifi/1.0.0-rc2/
> > >
> > > The Git tag is nifi-1.1.0-RC2
> > > The Git commit hash is f61e42c65e1c2387591ee368c2148cd5bda646bd
> > > * https://git-wip-us.apache.org/repos/asf?p=nifi.git;a=commit;
> > h=f61e42c65e1c2387591ee368c2148cd5bda646bd
> > > * https://github.com/apache/nifi/commit/f61e42c65e1c2387591ee3
> > 68c2148cd5bda646bd
> > >
> > > Checksums of nifi-1.1.0-source-release.zip:
> > > MD5: 371fb856d9c3947603239ea98f171f6f
> > > SHA1: 532c2e14e915dfa522254745bbc068aa6620babb
> > > SHA256: dd1d0569f209fd7f179b85a50fe4bf81b3d850c79b13d32cad88982a8234
> a719
> > >
> > > Release artifacts are signed with the following key:
> > >   https://people.apache.org/keys/committer/joewitt
> > >
> > > KEYS file available here:
> > >   https://dist.apache.org/repos/dist/release/nifi/KEYS
> > >
> > > 268 issues were closed/resolved for this release:
> > >   https://issues.apache.org/jira/secure/ReleaseNote.jspa?proj
> > ectId=12316020&version=12337875
> > >
> > >
> > > Release note highlights can be found here:
> > >   https://cwiki.apache.org/confluence/display/NIFI/Release+No
> > tes#ReleaseNotes-Version1.1.0
> > >
> > > The vote will be open for 72 hours.
> > > Please download the release candidate and evaluate the necessary items
> > > including checking hashes, signatures, build from source, and test.
> Then
> > > please vote:
> > >
> > > [ ] +1 Release this package as nifi-1.1.0
> > > [ ] +0 no opinion
> > > [ ] -1 Do not release this package because...
> > >
> > > Thanks!
> >
>
Reply | Threaded
Open this post in threaded view
|

Re: [VOTE] Release Apache NiFi 1.1.0 (RC2)

Yolanda Davis
In reply to this post by Aldrin Piri
Aldrin,

I saw the same exception on that test on OS X but it resolved when I
upgraded my version of java (upgraded to 1.8.0_111-b14)


On Sun, Nov 27, 2016 at 5:13 PM, Aldrin Piri <[hidden email]> wrote:

> +1, binding
>
> Hashes and signatures looked good.
> Contrib passed
> Builds and functionality were okay on OS X and Linux.
>
> I could not get a successful build on Windows 10 without removing some
> tests.  I ran into the item covered in
> https://issues.apache.org/jira/browse/NIFI-2692 from the 1.0 release as
> well as the following in TestInvokeJavascript.  This was with JDK
> 1.8.0u77.  Will create a ticket to capture but was not reproducible in any
> other environments inclusive of a Windows 7 VM.  Removing those tests
> produced a working build in Windows 10.
>
> [main] INFO org.apache.nifi.processors.script.InvokeScriptedProcessor -
> InvokeScriptedProcessor[id=11fe6a03-cb69-4b78-8b74-b16eeacc3710] logger is
> set! logger=org.apache.nifi.util.MockComponentLog@645aa696
> [main] ERROR org.apache.nifi.processors.script.InvokeScriptedProcessor -
> [InvokeScriptedProcessor[id=11fe6a03-cb69-4b78-8b74-b16eeacc3710]] Unable
> to validate the script Processor: java.lang.ClassCastException: Cannot cast
> jdk.nashorn.internal.objects.NativeArray to java.util.Collection
> java.lang.ClassCastException: Cannot cast
> jdk.nashorn.internal.objects.NativeArray
> to java.util.Collection
> at java.lang.invoke.MethodHandleImpl.newClassCastException(
> MethodHandleImpl.java:361)
> at java.lang.invoke.MethodHandleImpl.castReference(
> MethodHandleImpl.java:356)
> at org.apache.nifi.processor.Processor$$NashornJavaAdapter.
> validate(Unknown
> Source)
> at org.apache.nifi.processors.script.InvokeScriptedProcessor.
> customValidate(
> InvokeScriptedProcessor.java:464)
> at org.apache.nifi.components.AbstractConfigurableComponent.validate(
> AbstractConfigurableComponent.java:126)
> at org.apache.nifi.util.MockProcessContext.validate(
> MockProcessContext.java:226)
> at org.apache.nifi.util.MockProcessContext.assertValid(
> MockProcessContext.java:243)
> at org.apache.nifi.util.StandardProcessorTestRunner.assertValid(
> StandardProcessorTestRunner.java:334)
> at org.apache.nifi.processors.script.TestInvokeJavascript.
> testReadFlowFileContentAndStoreInFlowFileAttribute(
> TestInvokeJavascript.java:59)
> at sun.reflect.NativeMethodAccessorImpl.invoke0(Native Method)
> at sun.reflect.NativeMethodAccessorImpl.invoke(
> NativeMethodAccessorImpl.java:62)
> at sun.reflect.DelegatingMethodAccessorImpl.invoke(
> DelegatingMethodAccessorImpl.java:43)
> at java.lang.reflect.Method.invoke(Method.java:497)
> at org.junit.runners.model.FrameworkMethod$1.runReflectiveCall(
> FrameworkMethod.java:50)
> at org.junit.internal.runners.model.ReflectiveCallable.run(
> ReflectiveCallable.java:12)
> at org.junit.runners.model.FrameworkMethod.invokeExplosively(
> FrameworkMethod.java:47)
> at org.junit.internal.runners.statements.InvokeMethod.
> evaluate(InvokeMethod.java:17)
> at org.junit.internal.runners.statements.RunBefores.
> evaluate(RunBefores.java:26)
> at org.junit.runners.ParentRunner.runLeaf(ParentRunner.java:325)
> at org.junit.runners.BlockJUnit4ClassRunner.runChild(
> BlockJUnit4ClassRunner.java:78)
> at org.junit.runners.BlockJUnit4ClassRunner.runChild(
> BlockJUnit4ClassRunner.java:57)
> at org.junit.runners.ParentRunner$3.run(ParentRunner.java:290)
> at org.junit.runners.ParentRunner$1.schedule(ParentRunner.java:71)
> at org.junit.runners.ParentRunner.runChildren(ParentRunner.java:288)
> at org.junit.runners.ParentRunner.access$000(ParentRunner.java:58)
> at org.junit.runners.ParentRunner$2.evaluate(ParentRunner.java:268)
> at org.junit.internal.runners.statements.RunBefores.
> evaluate(RunBefores.java:26)
> at org.junit.runners.ParentRunner.run(ParentRunner.java:363)
> at org.junit.runner.JUnitCore.run(JUnitCore.java:137)
> at com.intellij.junit4.JUnit4IdeaTestRunner.startRunnerWithArgs(
> JUnit4IdeaTestRunner.java:78)
> at com.intellij.rt.execution.junit.JUnitStarter.prepareStreamsAndStart(
> JUnitStarter.java:212)
> at com.intellij.rt.execution.junit.JUnitStarter.main(JUnitStarter.java:68)
> at sun.reflect.NativeMethodAccessorImpl.invoke0(Native Method)
> at sun.reflect.NativeMethodAccessorImpl.invoke(
> NativeMethodAccessorImpl.java:62)
> at sun.reflect.DelegatingMethodAccessorImpl.invoke(
> DelegatingMethodAccessorImpl.java:43)
> at java.lang.reflect.Method.invoke(Method.java:497)
> at com.intellij.rt.execution.application.AppMain.main(AppMain.java:140)
>
> java.lang.AssertionError: Processor has 1 validation failures:
> 'Validation' validated against
> 'target/test/resources/javascript/test_reader.js'
> is invalid because An error occurred calling validate in the configured
> script Processor.
>
> at org.junit.Assert.fail(Assert.java:88)
> at org.apache.nifi.util.MockProcessContext.assertValid(
> MockProcessContext.java:251)
> at org.apache.nifi.util.StandardProcessorTestRunner.assertValid(
> StandardProcessorTestRunner.java:334)
> at org.apache.nifi.processors.script.TestInvokeJavascript.
> testReadFlowFileContentAndStoreInFlowFileAttribute(
> TestInvokeJavascript.java:59)
> at sun.reflect.NativeMethodAccessorImpl.invoke0(Native Method)
> at sun.reflect.NativeMethodAccessorImpl.invoke(
> NativeMethodAccessorImpl.java:62)
> at sun.reflect.DelegatingMethodAccessorImpl.invoke(
> DelegatingMethodAccessorImpl.java:43)
> at org.junit.runners.model.FrameworkMethod$1.runReflectiveCall(
> FrameworkMethod.java:50)
> at org.junit.internal.runners.model.ReflectiveCallable.run(
> ReflectiveCallable.java:12)
> at org.junit.runners.model.FrameworkMethod.invokeExplosively(
> FrameworkMethod.java:47)
> at org.junit.internal.runners.statements.InvokeMethod.
> evaluate(InvokeMethod.java:17)
> at org.junit.internal.runners.statements.RunBefores.
> evaluate(RunBefores.java:26)
> at org.junit.runners.ParentRunner.runLeaf(ParentRunner.java:325)
> at org.junit.runners.BlockJUnit4ClassRunner.runChild(
> BlockJUnit4ClassRunner.java:78)
> at org.junit.runners.BlockJUnit4ClassRunner.runChild(
> BlockJUnit4ClassRunner.java:57)
> at org.junit.runners.ParentRunner$3.run(ParentRunner.java:290)
> at org.junit.runners.ParentRunner$1.schedule(ParentRunner.java:71)
> at org.junit.runners.ParentRunner.runChildren(ParentRunner.java:288)
> at org.junit.runners.ParentRunner.access$000(ParentRunner.java:58)
> at org.junit.runners.ParentRunner$2.evaluate(ParentRunner.java:268)
> at org.junit.internal.runners.statements.RunBefores.
> evaluate(RunBefores.java:26)
> at org.junit.runners.ParentRunner.run(ParentRunner.java:363)
> at org.junit.runner.JUnitCore.run(JUnitCore.java:137)
> at com.intellij.junit4.JUnit4IdeaTestRunner.startRunnerWithArgs(
> JUnit4IdeaTestRunner.java:78)
> at com.intellij.rt.execution.junit.JUnitStarter.prepareStreamsAndStart(
> JUnitStarter.java:212)
> at com.intellij.rt.execution.junit.JUnitStarter.main(JUnitStarter.java:68)
> at sun.reflect.NativeMethodAccessorImpl.invoke0(Native Method)
> at sun.reflect.NativeMethodAccessorImpl.invoke(
> NativeMethodAccessorImpl.java:62)
> at com.intellij.rt.execution.application.AppMain.main(AppMain.java:140)
>
>
> Process finished with exit code -1
>
>
> On Sat, Nov 26, 2016 at 1:14 AM, Joe Witt <[hidden email]> wrote:
>
> > +1 (binding).
> >
> > Verified the primary finding from RC1 was addressed.
> > Verified the finding with RAT completion on windows from RC1 was
> addressed.
> > Verified the test timeout issue was improved.
> >
> > Built using a full clean build with contrib check successfully on OSX,
> > Linux, and Windows 10.
> > Built using a parallel build successfully on OSX, Linux, and logged a
> > JIRA for a test failure on Windows 10.
> >
> > Tested application behavior on each system (osx, linux, windows 10)
> > using Chrome, Firefox, and MS Edge.
> >
> > Thanks
> > Joe
> >
> > On Sat, Nov 26, 2016 at 1:11 AM, Joe Witt <[hidden email]> wrote:
> > > Hello Apache NiFi Community,
> > >
> > > I am pleased to be calling this vote for the source release of Apache
> > NiFi,
> > > nifi-1.1.0.
> > >
> > > The source release zip and convenience binaries, including signatures
> > > and digests can be found at:
> > >   https://dist.apache.org/repos/dist/dev/nifi/1.0.0-rc2/
> > >
> > > The Git tag is nifi-1.1.0-RC2
> > > The Git commit hash is f61e42c65e1c2387591ee368c2148cd5bda646bd
> > > * https://git-wip-us.apache.org/repos/asf?p=nifi.git;a=commit;
> > h=f61e42c65e1c2387591ee368c2148cd5bda646bd
> > > * https://github.com/apache/nifi/commit/f61e42c65e1c2387591ee3
> > 68c2148cd5bda646bd
> > >
> > > Checksums of nifi-1.1.0-source-release.zip:
> > > MD5: 371fb856d9c3947603239ea98f171f6f
> > > SHA1: 532c2e14e915dfa522254745bbc068aa6620babb
> > > SHA256: dd1d0569f209fd7f179b85a50fe4bf81b3d850c79b13d32cad88982a8234
> a719
> > >
> > > Release artifacts are signed with the following key:
> > >   https://people.apache.org/keys/committer/joewitt
> > >
> > > KEYS file available here:
> > >   https://dist.apache.org/repos/dist/release/nifi/KEYS
> > >
> > > 268 issues were closed/resolved for this release:
> > >   https://issues.apache.org/jira/secure/ReleaseNote.jspa?proj
> > ectId=12316020&version=12337875
> > >
> > >
> > > Release note highlights can be found here:
> > >   https://cwiki.apache.org/confluence/display/NIFI/Release+No
> > tes#ReleaseNotes-Version1.1.0
> > >
> > > The vote will be open for 72 hours.
> > > Please download the release candidate and evaluate the necessary items
> > > including checking hashes, signatures, build from source, and test.
> Then
> > > please vote:
> > >
> > > [ ] +1 Release this package as nifi-1.1.0
> > > [ ] +0 no opinion
> > > [ ] -1 Do not release this package because...
> > >
> > > Thanks!
> >
>



--
--
[hidden email]
@YolandaMDavis
Reply | Threaded
Open this post in threaded view
|

Re: [VOTE] Release Apache NiFi 1.1.0 (RC2)

Koji Kawamura-2
+1 (non-binding)

- Verified checksums
- Successfully ran mvn clean install, on OS X and Windows Server 2016,
with Oracle JDK 1.8.0_111-b14, mvn 3.3.9
- Run example data flows on OS X and Windows

Building and testing on Windows went well without issue. I hope the
InvokeScriptedProcessor test failure Aldrin encountered was caused by
Java version difference.


On Mon, Nov 28, 2016 at 8:05 AM, Yolanda Davis
<[hidden email]> wrote:

> Aldrin,
>
> I saw the same exception on that test on OS X but it resolved when I
> upgraded my version of java (upgraded to 1.8.0_111-b14)
>
>
> On Sun, Nov 27, 2016 at 5:13 PM, Aldrin Piri <[hidden email]> wrote:
>
>> +1, binding
>>
>> Hashes and signatures looked good.
>> Contrib passed
>> Builds and functionality were okay on OS X and Linux.
>>
>> I could not get a successful build on Windows 10 without removing some
>> tests.  I ran into the item covered in
>> https://issues.apache.org/jira/browse/NIFI-2692 from the 1.0 release as
>> well as the following in TestInvokeJavascript.  This was with JDK
>> 1.8.0u77.  Will create a ticket to capture but was not reproducible in any
>> other environments inclusive of a Windows 7 VM.  Removing those tests
>> produced a working build in Windows 10.
>>
>> [main] INFO org.apache.nifi.processors.script.InvokeScriptedProcessor -
>> InvokeScriptedProcessor[id=11fe6a03-cb69-4b78-8b74-b16eeacc3710] logger is
>> set! logger=org.apache.nifi.util.MockComponentLog@645aa696
>> [main] ERROR org.apache.nifi.processors.script.InvokeScriptedProcessor -
>> [InvokeScriptedProcessor[id=11fe6a03-cb69-4b78-8b74-b16eeacc3710]] Unable
>> to validate the script Processor: java.lang.ClassCastException: Cannot cast
>> jdk.nashorn.internal.objects.NativeArray to java.util.Collection
>> java.lang.ClassCastException: Cannot cast
>> jdk.nashorn.internal.objects.NativeArray
>> to java.util.Collection
>> at java.lang.invoke.MethodHandleImpl.newClassCastException(
>> MethodHandleImpl.java:361)
>> at java.lang.invoke.MethodHandleImpl.castReference(
>> MethodHandleImpl.java:356)
>> at org.apache.nifi.processor.Processor$$NashornJavaAdapter.
>> validate(Unknown
>> Source)
>> at org.apache.nifi.processors.script.InvokeScriptedProcessor.
>> customValidate(
>> InvokeScriptedProcessor.java:464)
>> at org.apache.nifi.components.AbstractConfigurableComponent.validate(
>> AbstractConfigurableComponent.java:126)
>> at org.apache.nifi.util.MockProcessContext.validate(
>> MockProcessContext.java:226)
>> at org.apache.nifi.util.MockProcessContext.assertValid(
>> MockProcessContext.java:243)
>> at org.apache.nifi.util.StandardProcessorTestRunner.assertValid(
>> StandardProcessorTestRunner.java:334)
>> at org.apache.nifi.processors.script.TestInvokeJavascript.
>> testReadFlowFileContentAndStoreInFlowFileAttribute(
>> TestInvokeJavascript.java:59)
>> at sun.reflect.NativeMethodAccessorImpl.invoke0(Native Method)
>> at sun.reflect.NativeMethodAccessorImpl.invoke(
>> NativeMethodAccessorImpl.java:62)
>> at sun.reflect.DelegatingMethodAccessorImpl.invoke(
>> DelegatingMethodAccessorImpl.java:43)
>> at java.lang.reflect.Method.invoke(Method.java:497)
>> at org.junit.runners.model.FrameworkMethod$1.runReflectiveCall(
>> FrameworkMethod.java:50)
>> at org.junit.internal.runners.model.ReflectiveCallable.run(
>> ReflectiveCallable.java:12)
>> at org.junit.runners.model.FrameworkMethod.invokeExplosively(
>> FrameworkMethod.java:47)
>> at org.junit.internal.runners.statements.InvokeMethod.
>> evaluate(InvokeMethod.java:17)
>> at org.junit.internal.runners.statements.RunBefores.
>> evaluate(RunBefores.java:26)
>> at org.junit.runners.ParentRunner.runLeaf(ParentRunner.java:325)
>> at org.junit.runners.BlockJUnit4ClassRunner.runChild(
>> BlockJUnit4ClassRunner.java:78)
>> at org.junit.runners.BlockJUnit4ClassRunner.runChild(
>> BlockJUnit4ClassRunner.java:57)
>> at org.junit.runners.ParentRunner$3.run(ParentRunner.java:290)
>> at org.junit.runners.ParentRunner$1.schedule(ParentRunner.java:71)
>> at org.junit.runners.ParentRunner.runChildren(ParentRunner.java:288)
>> at org.junit.runners.ParentRunner.access$000(ParentRunner.java:58)
>> at org.junit.runners.ParentRunner$2.evaluate(ParentRunner.java:268)
>> at org.junit.internal.runners.statements.RunBefores.
>> evaluate(RunBefores.java:26)
>> at org.junit.runners.ParentRunner.run(ParentRunner.java:363)
>> at org.junit.runner.JUnitCore.run(JUnitCore.java:137)
>> at com.intellij.junit4.JUnit4IdeaTestRunner.startRunnerWithArgs(
>> JUnit4IdeaTestRunner.java:78)
>> at com.intellij.rt.execution.junit.JUnitStarter.prepareStreamsAndStart(
>> JUnitStarter.java:212)
>> at com.intellij.rt.execution.junit.JUnitStarter.main(JUnitStarter.java:68)
>> at sun.reflect.NativeMethodAccessorImpl.invoke0(Native Method)
>> at sun.reflect.NativeMethodAccessorImpl.invoke(
>> NativeMethodAccessorImpl.java:62)
>> at sun.reflect.DelegatingMethodAccessorImpl.invoke(
>> DelegatingMethodAccessorImpl.java:43)
>> at java.lang.reflect.Method.invoke(Method.java:497)
>> at com.intellij.rt.execution.application.AppMain.main(AppMain.java:140)
>>
>> java.lang.AssertionError: Processor has 1 validation failures:
>> 'Validation' validated against
>> 'target/test/resources/javascript/test_reader.js'
>> is invalid because An error occurred calling validate in the configured
>> script Processor.
>>
>> at org.junit.Assert.fail(Assert.java:88)
>> at org.apache.nifi.util.MockProcessContext.assertValid(
>> MockProcessContext.java:251)
>> at org.apache.nifi.util.StandardProcessorTestRunner.assertValid(
>> StandardProcessorTestRunner.java:334)
>> at org.apache.nifi.processors.script.TestInvokeJavascript.
>> testReadFlowFileContentAndStoreInFlowFileAttribute(
>> TestInvokeJavascript.java:59)
>> at sun.reflect.NativeMethodAccessorImpl.invoke0(Native Method)
>> at sun.reflect.NativeMethodAccessorImpl.invoke(
>> NativeMethodAccessorImpl.java:62)
>> at sun.reflect.DelegatingMethodAccessorImpl.invoke(
>> DelegatingMethodAccessorImpl.java:43)
>> at org.junit.runners.model.FrameworkMethod$1.runReflectiveCall(
>> FrameworkMethod.java:50)
>> at org.junit.internal.runners.model.ReflectiveCallable.run(
>> ReflectiveCallable.java:12)
>> at org.junit.runners.model.FrameworkMethod.invokeExplosively(
>> FrameworkMethod.java:47)
>> at org.junit.internal.runners.statements.InvokeMethod.
>> evaluate(InvokeMethod.java:17)
>> at org.junit.internal.runners.statements.RunBefores.
>> evaluate(RunBefores.java:26)
>> at org.junit.runners.ParentRunner.runLeaf(ParentRunner.java:325)
>> at org.junit.runners.BlockJUnit4ClassRunner.runChild(
>> BlockJUnit4ClassRunner.java:78)
>> at org.junit.runners.BlockJUnit4ClassRunner.runChild(
>> BlockJUnit4ClassRunner.java:57)
>> at org.junit.runners.ParentRunner$3.run(ParentRunner.java:290)
>> at org.junit.runners.ParentRunner$1.schedule(ParentRunner.java:71)
>> at org.junit.runners.ParentRunner.runChildren(ParentRunner.java:288)
>> at org.junit.runners.ParentRunner.access$000(ParentRunner.java:58)
>> at org.junit.runners.ParentRunner$2.evaluate(ParentRunner.java:268)
>> at org.junit.internal.runners.statements.RunBefores.
>> evaluate(RunBefores.java:26)
>> at org.junit.runners.ParentRunner.run(ParentRunner.java:363)
>> at org.junit.runner.JUnitCore.run(JUnitCore.java:137)
>> at com.intellij.junit4.JUnit4IdeaTestRunner.startRunnerWithArgs(
>> JUnit4IdeaTestRunner.java:78)
>> at com.intellij.rt.execution.junit.JUnitStarter.prepareStreamsAndStart(
>> JUnitStarter.java:212)
>> at com.intellij.rt.execution.junit.JUnitStarter.main(JUnitStarter.java:68)
>> at sun.reflect.NativeMethodAccessorImpl.invoke0(Native Method)
>> at sun.reflect.NativeMethodAccessorImpl.invoke(
>> NativeMethodAccessorImpl.java:62)
>> at com.intellij.rt.execution.application.AppMain.main(AppMain.java:140)
>>
>>
>> Process finished with exit code -1
>>
>>
>> On Sat, Nov 26, 2016 at 1:14 AM, Joe Witt <[hidden email]> wrote:
>>
>> > +1 (binding).
>> >
>> > Verified the primary finding from RC1 was addressed.
>> > Verified the finding with RAT completion on windows from RC1 was
>> addressed.
>> > Verified the test timeout issue was improved.
>> >
>> > Built using a full clean build with contrib check successfully on OSX,
>> > Linux, and Windows 10.
>> > Built using a parallel build successfully on OSX, Linux, and logged a
>> > JIRA for a test failure on Windows 10.
>> >
>> > Tested application behavior on each system (osx, linux, windows 10)
>> > using Chrome, Firefox, and MS Edge.
>> >
>> > Thanks
>> > Joe
>> >
>> > On Sat, Nov 26, 2016 at 1:11 AM, Joe Witt <[hidden email]> wrote:
>> > > Hello Apache NiFi Community,
>> > >
>> > > I am pleased to be calling this vote for the source release of Apache
>> > NiFi,
>> > > nifi-1.1.0.
>> > >
>> > > The source release zip and convenience binaries, including signatures
>> > > and digests can be found at:
>> > >   https://dist.apache.org/repos/dist/dev/nifi/1.0.0-rc2/
>> > >
>> > > The Git tag is nifi-1.1.0-RC2
>> > > The Git commit hash is f61e42c65e1c2387591ee368c2148cd5bda646bd
>> > > * https://git-wip-us.apache.org/repos/asf?p=nifi.git;a=commit;
>> > h=f61e42c65e1c2387591ee368c2148cd5bda646bd
>> > > * https://github.com/apache/nifi/commit/f61e42c65e1c2387591ee3
>> > 68c2148cd5bda646bd
>> > >
>> > > Checksums of nifi-1.1.0-source-release.zip:
>> > > MD5: 371fb856d9c3947603239ea98f171f6f
>> > > SHA1: 532c2e14e915dfa522254745bbc068aa6620babb
>> > > SHA256: dd1d0569f209fd7f179b85a50fe4bf81b3d850c79b13d32cad88982a8234
>> a719
>> > >
>> > > Release artifacts are signed with the following key:
>> > >   https://people.apache.org/keys/committer/joewitt
>> > >
>> > > KEYS file available here:
>> > >   https://dist.apache.org/repos/dist/release/nifi/KEYS
>> > >
>> > > 268 issues were closed/resolved for this release:
>> > >   https://issues.apache.org/jira/secure/ReleaseNote.jspa?proj
>> > ectId=12316020&version=12337875
>> > >
>> > >
>> > > Release note highlights can be found here:
>> > >   https://cwiki.apache.org/confluence/display/NIFI/Release+No
>> > tes#ReleaseNotes-Version1.1.0
>> > >
>> > > The vote will be open for 72 hours.
>> > > Please download the release candidate and evaluate the necessary items
>> > > including checking hashes, signatures, build from source, and test.
>> Then
>> > > please vote:
>> > >
>> > > [ ] +1 Release this package as nifi-1.1.0
>> > > [ ] +0 no opinion
>> > > [ ] -1 Do not release this package because...
>> > >
>> > > Thanks!
>> >
>>
>
>
>
> --
> --
> [hidden email]
> @YolandaMDavis
Reply | Threaded
Open this post in threaded view
|

Re: [VOTE] Release Apache NiFi 1.1.0 (RC2)

Tony Kurc
+1 from me. Built without issue for me on Windows 10 and Ubuntu 14.04
(x86_64). My sample flows ran without issue. Did not spot any issues with
licenses. Signature and hashes verified.

On Nov 27, 2016 8:32 PM, "Koji Kawamura" <[hidden email]> wrote:

> +1 (non-binding)
>
> - Verified checksums
> - Successfully ran mvn clean install, on OS X and Windows Server 2016,
> with Oracle JDK 1.8.0_111-b14, mvn 3.3.9
> - Run example data flows on OS X and Windows
>
> Building and testing on Windows went well without issue. I hope the
> InvokeScriptedProcessor test failure Aldrin encountered was caused by
> Java version difference.
>
>
> On Mon, Nov 28, 2016 at 8:05 AM, Yolanda Davis
> <[hidden email]> wrote:
> > Aldrin,
> >
> > I saw the same exception on that test on OS X but it resolved when I
> > upgraded my version of java (upgraded to 1.8.0_111-b14)
> >
> >
> > On Sun, Nov 27, 2016 at 5:13 PM, Aldrin Piri <[hidden email]>
> wrote:
> >
> >> +1, binding
> >>
> >> Hashes and signatures looked good.
> >> Contrib passed
> >> Builds and functionality were okay on OS X and Linux.
> >>
> >> I could not get a successful build on Windows 10 without removing some
> >> tests.  I ran into the item covered in
> >> https://issues.apache.org/jira/browse/NIFI-2692 from the 1.0 release as
> >> well as the following in TestInvokeJavascript.  This was with JDK
> >> 1.8.0u77.  Will create a ticket to capture but was not reproducible in
> any
> >> other environments inclusive of a Windows 7 VM.  Removing those tests
> >> produced a working build in Windows 10.
> >>
> >> [main] INFO org.apache.nifi.processors.script.InvokeScriptedProcessor -
> >> InvokeScriptedProcessor[id=11fe6a03-cb69-4b78-8b74-b16eeacc3710]
> logger is
> >> set! logger=org.apache.nifi.util.MockComponentLog@645aa696
> >> [main] ERROR org.apache.nifi.processors.script.InvokeScriptedProcessor
> -
> >> [InvokeScriptedProcessor[id=11fe6a03-cb69-4b78-8b74-b16eeacc3710]]
> Unable
> >> to validate the script Processor: java.lang.ClassCastException: Cannot
> cast
> >> jdk.nashorn.internal.objects.NativeArray to java.util.Collection
> >> java.lang.ClassCastException: Cannot cast
> >> jdk.nashorn.internal.objects.NativeArray
> >> to java.util.Collection
> >> at java.lang.invoke.MethodHandleImpl.newClassCastException(
> >> MethodHandleImpl.java:361)
> >> at java.lang.invoke.MethodHandleImpl.castReference(
> >> MethodHandleImpl.java:356)
> >> at org.apache.nifi.processor.Processor$$NashornJavaAdapter.
> >> validate(Unknown
> >> Source)
> >> at org.apache.nifi.processors.script.InvokeScriptedProcessor.
> >> customValidate(
> >> InvokeScriptedProcessor.java:464)
> >> at org.apache.nifi.components.AbstractConfigurableComponent.validate(
> >> AbstractConfigurableComponent.java:126)
> >> at org.apache.nifi.util.MockProcessContext.validate(
> >> MockProcessContext.java:226)
> >> at org.apache.nifi.util.MockProcessContext.assertValid(
> >> MockProcessContext.java:243)
> >> at org.apache.nifi.util.StandardProcessorTestRunner.assertValid(
> >> StandardProcessorTestRunner.java:334)
> >> at org.apache.nifi.processors.script.TestInvokeJavascript.
> >> testReadFlowFileContentAndStoreInFlowFileAttribute(
> >> TestInvokeJavascript.java:59)
> >> at sun.reflect.NativeMethodAccessorImpl.invoke0(Native Method)
> >> at sun.reflect.NativeMethodAccessorImpl.invoke(
> >> NativeMethodAccessorImpl.java:62)
> >> at sun.reflect.DelegatingMethodAccessorImpl.invoke(
> >> DelegatingMethodAccessorImpl.java:43)
> >> at java.lang.reflect.Method.invoke(Method.java:497)
> >> at org.junit.runners.model.FrameworkMethod$1.runReflectiveCall(
> >> FrameworkMethod.java:50)
> >> at org.junit.internal.runners.model.ReflectiveCallable.run(
> >> ReflectiveCallable.java:12)
> >> at org.junit.runners.model.FrameworkMethod.invokeExplosively(
> >> FrameworkMethod.java:47)
> >> at org.junit.internal.runners.statements.InvokeMethod.
> >> evaluate(InvokeMethod.java:17)
> >> at org.junit.internal.runners.statements.RunBefores.
> >> evaluate(RunBefores.java:26)
> >> at org.junit.runners.ParentRunner.runLeaf(ParentRunner.java:325)
> >> at org.junit.runners.BlockJUnit4ClassRunner.runChild(
> >> BlockJUnit4ClassRunner.java:78)
> >> at org.junit.runners.BlockJUnit4ClassRunner.runChild(
> >> BlockJUnit4ClassRunner.java:57)
> >> at org.junit.runners.ParentRunner$3.run(ParentRunner.java:290)
> >> at org.junit.runners.ParentRunner$1.schedule(ParentRunner.java:71)
> >> at org.junit.runners.ParentRunner.runChildren(ParentRunner.java:288)
> >> at org.junit.runners.ParentRunner.access$000(ParentRunner.java:58)
> >> at org.junit.runners.ParentRunner$2.evaluate(ParentRunner.java:268)
> >> at org.junit.internal.runners.statements.RunBefores.
> >> evaluate(RunBefores.java:26)
> >> at org.junit.runners.ParentRunner.run(ParentRunner.java:363)
> >> at org.junit.runner.JUnitCore.run(JUnitCore.java:137)
> >> at com.intellij.junit4.JUnit4IdeaTestRunner.startRunnerWithArgs(
> >> JUnit4IdeaTestRunner.java:78)
> >> at com.intellij.rt.execution.junit.JUnitStarter.prepareStreamsAndStart(
> >> JUnitStarter.java:212)
> >> at com.intellij.rt.execution.junit.JUnitStarter.main(
> JUnitStarter.java:68)
> >> at sun.reflect.NativeMethodAccessorImpl.invoke0(Native Method)
> >> at sun.reflect.NativeMethodAccessorImpl.invoke(
> >> NativeMethodAccessorImpl.java:62)
> >> at sun.reflect.DelegatingMethodAccessorImpl.invoke(
> >> DelegatingMethodAccessorImpl.java:43)
> >> at java.lang.reflect.Method.invoke(Method.java:497)
> >> at com.intellij.rt.execution.application.AppMain.main(AppMain.java:140)
> >>
> >> java.lang.AssertionError: Processor has 1 validation failures:
> >> 'Validation' validated against
> >> 'target/test/resources/javascript/test_reader.js'
> >> is invalid because An error occurred calling validate in the configured
> >> script Processor.
> >>
> >> at org.junit.Assert.fail(Assert.java:88)
> >> at org.apache.nifi.util.MockProcessContext.assertValid(
> >> MockProcessContext.java:251)
> >> at org.apache.nifi.util.StandardProcessorTestRunner.assertValid(
> >> StandardProcessorTestRunner.java:334)
> >> at org.apache.nifi.processors.script.TestInvokeJavascript.
> >> testReadFlowFileContentAndStoreInFlowFileAttribute(
> >> TestInvokeJavascript.java:59)
> >> at sun.reflect.NativeMethodAccessorImpl.invoke0(Native Method)
> >> at sun.reflect.NativeMethodAccessorImpl.invoke(
> >> NativeMethodAccessorImpl.java:62)
> >> at sun.reflect.DelegatingMethodAccessorImpl.invoke(
> >> DelegatingMethodAccessorImpl.java:43)
> >> at org.junit.runners.model.FrameworkMethod$1.runReflectiveCall(
> >> FrameworkMethod.java:50)
> >> at org.junit.internal.runners.model.ReflectiveCallable.run(
> >> ReflectiveCallable.java:12)
> >> at org.junit.runners.model.FrameworkMethod.invokeExplosively(
> >> FrameworkMethod.java:47)
> >> at org.junit.internal.runners.statements.InvokeMethod.
> >> evaluate(InvokeMethod.java:17)
> >> at org.junit.internal.runners.statements.RunBefores.
> >> evaluate(RunBefores.java:26)
> >> at org.junit.runners.ParentRunner.runLeaf(ParentRunner.java:325)
> >> at org.junit.runners.BlockJUnit4ClassRunner.runChild(
> >> BlockJUnit4ClassRunner.java:78)
> >> at org.junit.runners.BlockJUnit4ClassRunner.runChild(
> >> BlockJUnit4ClassRunner.java:57)
> >> at org.junit.runners.ParentRunner$3.run(ParentRunner.java:290)
> >> at org.junit.runners.ParentRunner$1.schedule(ParentRunner.java:71)
> >> at org.junit.runners.ParentRunner.runChildren(ParentRunner.java:288)
> >> at org.junit.runners.ParentRunner.access$000(ParentRunner.java:58)
> >> at org.junit.runners.ParentRunner$2.evaluate(ParentRunner.java:268)
> >> at org.junit.internal.runners.statements.RunBefores.
> >> evaluate(RunBefores.java:26)
> >> at org.junit.runners.ParentRunner.run(ParentRunner.java:363)
> >> at org.junit.runner.JUnitCore.run(JUnitCore.java:137)
> >> at com.intellij.junit4.JUnit4IdeaTestRunner.startRunnerWithArgs(
> >> JUnit4IdeaTestRunner.java:78)
> >> at com.intellij.rt.execution.junit.JUnitStarter.prepareStreamsAndStart(
> >> JUnitStarter.java:212)
> >> at com.intellij.rt.execution.junit.JUnitStarter.main(
> JUnitStarter.java:68)
> >> at sun.reflect.NativeMethodAccessorImpl.invoke0(Native Method)
> >> at sun.reflect.NativeMethodAccessorImpl.invoke(
> >> NativeMethodAccessorImpl.java:62)
> >> at com.intellij.rt.execution.application.AppMain.main(AppMain.java:140)
> >>
> >>
> >> Process finished with exit code -1
> >>
> >>
> >> On Sat, Nov 26, 2016 at 1:14 AM, Joe Witt <[hidden email]> wrote:
> >>
> >> > +1 (binding).
> >> >
> >> > Verified the primary finding from RC1 was addressed.
> >> > Verified the finding with RAT completion on windows from RC1 was
> >> addressed.
> >> > Verified the test timeout issue was improved.
> >> >
> >> > Built using a full clean build with contrib check successfully on OSX,
> >> > Linux, and Windows 10.
> >> > Built using a parallel build successfully on OSX, Linux, and logged a
> >> > JIRA for a test failure on Windows 10.
> >> >
> >> > Tested application behavior on each system (osx, linux, windows 10)
> >> > using Chrome, Firefox, and MS Edge.
> >> >
> >> > Thanks
> >> > Joe
> >> >
> >> > On Sat, Nov 26, 2016 at 1:11 AM, Joe Witt <[hidden email]> wrote:
> >> > > Hello Apache NiFi Community,
> >> > >
> >> > > I am pleased to be calling this vote for the source release of
> Apache
> >> > NiFi,
> >> > > nifi-1.1.0.
> >> > >
> >> > > The source release zip and convenience binaries, including
> signatures
> >> > > and digests can be found at:
> >> > >   https://dist.apache.org/repos/dist/dev/nifi/1.0.0-rc2/
> >> > >
> >> > > The Git tag is nifi-1.1.0-RC2
> >> > > The Git commit hash is f61e42c65e1c2387591ee368c2148cd5bda646bd
> >> > > * https://git-wip-us.apache.org/repos/asf?p=nifi.git;a=commit;
> >> > h=f61e42c65e1c2387591ee368c2148cd5bda646bd
> >> > > * https://github.com/apache/nifi/commit/f61e42c65e1c2387591ee3
> >> > 68c2148cd5bda646bd
> >> > >
> >> > > Checksums of nifi-1.1.0-source-release.zip:
> >> > > MD5: 371fb856d9c3947603239ea98f171f6f
> >> > > SHA1: 532c2e14e915dfa522254745bbc068aa6620babb
> >> > > SHA256: dd1d0569f209fd7f179b85a50fe4bf
> 81b3d850c79b13d32cad88982a8234
> >> a719
> >> > >
> >> > > Release artifacts are signed with the following key:
> >> > >   https://people.apache.org/keys/committer/joewitt
> >> > >
> >> > > KEYS file available here:
> >> > >   https://dist.apache.org/repos/dist/release/nifi/KEYS
> >> > >
> >> > > 268 issues were closed/resolved for this release:
> >> > >   https://issues.apache.org/jira/secure/ReleaseNote.jspa?proj
> >> > ectId=12316020&version=12337875
> >> > >
> >> > >
> >> > > Release note highlights can be found here:
> >> > >   https://cwiki.apache.org/confluence/display/NIFI/Release+No
> >> > tes#ReleaseNotes-Version1.1.0
> >> > >
> >> > > The vote will be open for 72 hours.
> >> > > Please download the release candidate and evaluate the necessary
> items
> >> > > including checking hashes, signatures, build from source, and test.
> >> Then
> >> > > please vote:
> >> > >
> >> > > [ ] +1 Release this package as nifi-1.1.0
> >> > > [ ] +0 no opinion
> >> > > [ ] -1 Do not release this package because...
> >> > >
> >> > > Thanks!
> >> >
> >>
> >
> >
> >
> > --
> > --
> > [hidden email]
> > @YolandaMDavis
>
Reply | Threaded
Open this post in threaded view
|

Re: [VOTE] Release Apache NiFi 1.1.0 (RC2)

Yolanda Davis
In reply to this post by joewitt
+1 (non-binding)

Verified signatures, checksums, LICENSE and NOTICE
Build was successful  on OS X  (JDK 1.8.0_111-b14)
Tested basic flows in standalone and three node cluster (using GetTwitter,
JoltTransformJson, PutMongo)
Tested upgrade use case of moving from 1.0.0 to 1.1.0  (See Andre's email
from 11/25 @ 10:13 am for use case details)

Yolanda


On Sat, Nov 26, 2016 at 1:11 AM, Joe Witt <[hidden email]> wrote:

> Hello Apache NiFi Community,
>
> I am pleased to be calling this vote for the source release of Apache NiFi,
> nifi-1.1.0.
>
> The source release zip and convenience binaries, including signatures
> and digests can be found at:
>   https://dist.apache.org/repos/dist/dev/nifi/1.0.0-rc2/
>
> The Git tag is nifi-1.1.0-RC2
> The Git commit hash is f61e42c65e1c2387591ee368c2148cd5bda646bd
> * https://git-wip-us.apache.org/repos/asf?p=nifi.git;a=commit;h=
> f61e42c65e1c2387591ee368c2148cd5bda646bd
> * https://github.com/apache/nifi/commit/f61e42c65e1c2387591ee368c2148c
> d5bda646bd
>
> Checksums of nifi-1.1.0-source-release.zip:
> MD5: 371fb856d9c3947603239ea98f171f6f
> SHA1: 532c2e14e915dfa522254745bbc068aa6620babb
> SHA256: dd1d0569f209fd7f179b85a50fe4bf81b3d850c79b13d32cad88982a8234a719
>
> Release artifacts are signed with the following key:
>   https://people.apache.org/keys/committer/joewitt
>
> KEYS file available here:
>   https://dist.apache.org/repos/dist/release/nifi/KEYS
>
> 268 issues were closed/resolved for this release:
>   https://issues.apache.org/jira/secure/ReleaseNote.jspa?
> projectId=12316020&version=12337875
>
>
> Release note highlights can be found here:
>   https://cwiki.apache.org/confluence/display/NIFI/
> Release+Notes#ReleaseNotes-Version1.1.0
>
> The vote will be open for 72 hours.
> Please download the release candidate and evaluate the necessary items
> including checking hashes, signatures, build from source, and test. Then
> please vote:
>
> [ ] +1 Release this package as nifi-1.1.0
> [ ] +0 no opinion
> [ ] -1 Do not release this package because...
>
> Thanks!
>



--
--
[hidden email]
@YolandaMDavis
Reply | Threaded
Open this post in threaded view
|

Re: [VOTE] Release Apache NiFi 1.1.0 (RC2)

Pierre Villard
+1 (non-binding)

Full build with contrib-check on OS X and CentOS 7. (Apache Maven 3.3.9 /
Java version: 1.8.0_77)
Classic flows tested on unsecured and secured standalone instance, and on
unsecured cluster with embedded ZK.

Also tested on Windows 10:

mvn -version
Apache Maven 3.3.9 (bb52d8502b132ec0a5a3f4c09453c07478323dc5;
2015-11-10T17:41:47+01:00)
Java version: 1.8.0_74, vendor: Oracle Corporation
Default locale: fr_FR, platform encoding: Cp1252
OS name: "windows 10", version: "10.0", arch: "amd64", family: "dos"

Full build is OK expect following errors:

Failed tests:
  TestParseCEF.testSuccessfulParseToAttributes:85 Expected all Transferred
FlowFiles to go to success but 1 were routed to failure
  TestParseCEF.testSuccessfulParseToAttributesWithUTC:125 Expected all
Transferred FlowFiles to go to success but 1 were routed to failure
  TestParseCEF.testSuccessfulParseToContent:148 Expected all Transferred
FlowFiles to go to success but 1 were routed to failure
  TestParseCEF.testSuccessfulParseToContentUTC:217 Expected all Transferred
FlowFiles to go to success but 1 were routed to failure
  TestParseCEF.testSuccessfulParseToContentWhenCEFContainsJSON:180 Expected
all Transferred FlowFiles to go to success but 1 were routed to failure

With the following message:
[pool-4-thread-1] ERROR com.fluenda.parcefone.parser.CEFParser -
com.fluenda.parcefone.event.CEFHandlingException: Error setting value to
field rt

And one test error because of default locale:

Failed tests:
  StandardHttpResponseMapperSpec.MergeResponses: #responseEntities.size()
HTTP 200 #httpMethod responses for #requestUriPart:122 Condition not
satisfied:




2016-11-28 3:45 GMT+01:00 Yolanda Davis <[hidden email]>:

> +1 (non-binding)
>
> Verified signatures, checksums, LICENSE and NOTICE
> Build was successful  on OS X  (JDK 1.8.0_111-b14)
> Tested basic flows in standalone and three node cluster (using GetTwitter,
> JoltTransformJson, PutMongo)
> Tested upgrade use case of moving from 1.0.0 to 1.1.0  (See Andre's email
> from 11/25 @ 10:13 am for use case details)
>
> Yolanda
>
>
> On Sat, Nov 26, 2016 at 1:11 AM, Joe Witt <[hidden email]> wrote:
>
> > Hello Apache NiFi Community,
> >
> > I am pleased to be calling this vote for the source release of Apache
> NiFi,
> > nifi-1.1.0.
> >
> > The source release zip and convenience binaries, including signatures
> > and digests can be found at:
> >   https://dist.apache.org/repos/dist/dev/nifi/1.0.0-rc2/
> >
> > The Git tag is nifi-1.1.0-RC2
> > The Git commit hash is f61e42c65e1c2387591ee368c2148cd5bda646bd
> > * https://git-wip-us.apache.org/repos/asf?p=nifi.git;a=commit;h=
> > f61e42c65e1c2387591ee368c2148cd5bda646bd
> > * https://github.com/apache/nifi/commit/f61e42c65e1c2387591ee368c2148c
> > d5bda646bd
> >
> > Checksums of nifi-1.1.0-source-release.zip:
> > MD5: 371fb856d9c3947603239ea98f171f6f
> > SHA1: 532c2e14e915dfa522254745bbc068aa6620babb
> > SHA256: dd1d0569f209fd7f179b85a50fe4bf81b3d850c79b13d32cad88982a8234a719
> >
> > Release artifacts are signed with the following key:
> >   https://people.apache.org/keys/committer/joewitt
> >
> > KEYS file available here:
> >   https://dist.apache.org/repos/dist/release/nifi/KEYS
> >
> > 268 issues were closed/resolved for this release:
> >   https://issues.apache.org/jira/secure/ReleaseNote.jspa?
> > projectId=12316020&version=12337875
> >
> >
> > Release note highlights can be found here:
> >   https://cwiki.apache.org/confluence/display/NIFI/
> > Release+Notes#ReleaseNotes-Version1.1.0
> >
> > The vote will be open for 72 hours.
> > Please download the release candidate and evaluate the necessary items
> > including checking hashes, signatures, build from source, and test. Then
> > please vote:
> >
> > [ ] +1 Release this package as nifi-1.1.0
> > [ ] +0 no opinion
> > [ ] -1 Do not release this package because...
> >
> > Thanks!
> >
>
>
>
> --
> --
> [hidden email]
> @YolandaMDavis
>
Reply | Threaded
Open this post in threaded view
|

Re: [VOTE] Release Apache NiFi 1.1.0 (RC2)

Joe Gresock
In reply to this post by Yolanda Davis
+1 (non-binding)

Verified signatures, checksums, LICENSE, NOTICE, and README
Build and deployment succeeded on CentOS 6.8 (OpenJDK 1.8.0_111-b15)

Successfully tested a complex flow on a 3-node secured cluster with
embedded ZK with the following features:
* Self connections over site-to-site
* Put/Query/ScrollElasticsearchHttp processors
* Merge/UnpackContent with ffv3, zip, and ffv1/tar formats
* HandleHttpRequest/Response
* Get/Put/FetchFile
* GetSQS
* PutJMS/GetJMSQueue
* Extract/Replace/SplitText
* SplitJson/EvaluateJsonPath
* FetchS3Object
* DetectDuplicate
* DistributeLoad
* ExecuteStreamCommand
* Update/RouteOnAttributes

Successfully tested:
* Listing/emptying queues, and all views in UI.
* New restricted-components permission.
* Viewing and clearing state on ScrollElasticsearchHttp.
* Viewing and resetting counters.
* Disconnecting/connecting nodes, transferring PRIMARY and COORDINATOR
roles across nodes

Note: created NIFI-3106: Mouseover text for Counter reset button is
"Connect".  This is a really minor issue, I put it against the 1.2.0 fix
version.

On Mon, Nov 28, 2016 at 2:45 AM, Yolanda Davis <[hidden email]>
wrote:

> +1 (non-binding)
>
> Verified signatures, checksums, LICENSE and NOTICE
> Build was successful  on OS X  (JDK 1.8.0_111-b14)
> Tested basic flows in standalone and three node cluster (using GetTwitter,
> JoltTransformJson, PutMongo)
> Tested upgrade use case of moving from 1.0.0 to 1.1.0  (See Andre's email
> from 11/25 @ 10:13 am for use case details)
>
> Yolanda
>
>
> On Sat, Nov 26, 2016 at 1:11 AM, Joe Witt <[hidden email]> wrote:
>
> > Hello Apache NiFi Community,
> >
> > I am pleased to be calling this vote for the source release of Apache
> NiFi,
> > nifi-1.1.0.
> >
> > The source release zip and convenience binaries, including signatures
> > and digests can be found at:
> >   https://dist.apache.org/repos/dist/dev/nifi/1.0.0-rc2/
> >
> > The Git tag is nifi-1.1.0-RC2
> > The Git commit hash is f61e42c65e1c2387591ee368c2148cd5bda646bd
> > * https://git-wip-us.apache.org/repos/asf?p=nifi.git;a=commit;h=
> > f61e42c65e1c2387591ee368c2148cd5bda646bd
> > * https://github.com/apache/nifi/commit/f61e42c65e1c2387591ee368c2148c
> > d5bda646bd
> >
> > Checksums of nifi-1.1.0-source-release.zip:
> > MD5: 371fb856d9c3947603239ea98f171f6f
> > SHA1: 532c2e14e915dfa522254745bbc068aa6620babb
> > SHA256: dd1d0569f209fd7f179b85a50fe4bf81b3d850c79b13d32cad88982a8234a719
> >
> > Release artifacts are signed with the following key:
> >   https://people.apache.org/keys/committer/joewitt
> >
> > KEYS file available here:
> >   https://dist.apache.org/repos/dist/release/nifi/KEYS
> >
> > 268 issues were closed/resolved for this release:
> >   https://issues.apache.org/jira/secure/ReleaseNote.jspa?
> > projectId=12316020&version=12337875
> >
> >
> > Release note highlights can be found here:
> >   https://cwiki.apache.org/confluence/display/NIFI/
> > Release+Notes#ReleaseNotes-Version1.1.0
> >
> > The vote will be open for 72 hours.
> > Please download the release candidate and evaluate the necessary items
> > including checking hashes, signatures, build from source, and test. Then
> > please vote:
> >
> > [ ] +1 Release this package as nifi-1.1.0
> > [ ] +0 no opinion
> > [ ] -1 Do not release this package because...
> >
> > Thanks!
> >
>
>
>
> --
> --
> [hidden email]
> @YolandaMDavis
>



--
I know what it is to be in need, and I know what it is to have plenty.  I
have learned the secret of being content in any and every situation,
whether well fed or hungry, whether living in plenty or in want.  I can do
all this through him who gives me strength.    *-Philippians 4:12-13*
Reply | Threaded
Open this post in threaded view
|

Re: [VOTE] Release Apache NiFi 1.1.0 (RC2)

Matt Gilman
In reply to this post by joewitt
+1 Release this package as nifi-1.1.0

Ran through numerous configurations including standalone and clustered in
both secure and unsecured mode and all is working as excepted.

Matt

On Sat, Nov 26, 2016 at 1:11 AM, Joe Witt <[hidden email]> wrote:

> Hello Apache NiFi Community,
>
> I am pleased to be calling this vote for the source release of Apache NiFi,
> nifi-1.1.0.
>
> The source release zip and convenience binaries, including signatures
> and digests can be found at:
>   https://dist.apache.org/repos/dist/dev/nifi/1.0.0-rc2/
>
> The Git tag is nifi-1.1.0-RC2
> The Git commit hash is f61e42c65e1c2387591ee368c2148cd5bda646bd
> * https://git-wip-us.apache.org/repos/asf?p=nifi.git;a=commit;h=
> f61e42c65e1c2387591ee368c2148cd5bda646bd
> * https://github.com/apache/nifi/commit/f61e42c65e1c2387591ee368c2148c
> d5bda646bd
>
> Checksums of nifi-1.1.0-source-release.zip:
> MD5: 371fb856d9c3947603239ea98f171f6f
> SHA1: 532c2e14e915dfa522254745bbc068aa6620babb
> SHA256: dd1d0569f209fd7f179b85a50fe4bf81b3d850c79b13d32cad88982a8234a719
>
> Release artifacts are signed with the following key:
>   https://people.apache.org/keys/committer/joewitt
>
> KEYS file available here:
>   https://dist.apache.org/repos/dist/release/nifi/KEYS
>
> 268 issues were closed/resolved for this release:
>   https://issues.apache.org/jira/secure/ReleaseNote.jspa?
> projectId=12316020&version=12337875
>
>
> Release note highlights can be found here:
>   https://cwiki.apache.org/confluence/display/NIFI/
> Release+Notes#ReleaseNotes-Version1.1.0
>
> The vote will be open for 72 hours.
> Please download the release candidate and evaluate the necessary items
> including checking hashes, signatures, build from source, and test. Then
> please vote:
>
> [ ] +1 Release this package as nifi-1.1.0
> [ ] +0 no opinion
> [ ] -1 Do not release this package because...
>
> Thanks!
>
Reply | Threaded
Open this post in threaded view
|

Re: [VOTE] Release Apache NiFi 1.1.0 (RC2)

Mark Payne
In reply to this post by joewitt
+1 (binding)

Verified md5 and signing.
Verified application started up and functioned normally.
Performed build with contrib-check.

I did run into a test failure in the DBCPConnectionService. I've not seen anyone else report this yet,
so it may just be a weird environment that I have, perhaps.

I have created a JIRA for the issue [1]. The output that I get is in the JIRA. Given that I've not seen
others complaining of this, I don't think it's worth holding up the release for it, so I'm still a +1.

Thanks
-Mark

[1] https://issues.apache.org/jira/browse/NIFI-3107



On Nov 26, 2016, at 1:11 AM, Joe Witt <[hidden email]<mailto:[hidden email]>> wrote:

Hello Apache NiFi Community,

I am pleased to be calling this vote for the source release of Apache NiFi,
nifi-1.1.0.

The source release zip and convenience binaries, including signatures
and digests can be found at:
 https://dist.apache.org/repos/dist/dev/nifi/1.0.0-rc2/

The Git tag is nifi-1.1.0-RC2
The Git commit hash is f61e42c65e1c2387591ee368c2148cd5bda646bd
* https://git-wip-us.apache.org/repos/asf?p=nifi.git;a=commit;h=f61e42c65e1c2387591ee368c2148cd5bda646bd
* https://github.com/apache/nifi/commit/f61e42c65e1c2387591ee368c2148cd5bda646bd

Checksums of nifi-1.1.0-source-release.zip:
MD5: 371fb856d9c3947603239ea98f171f6f
SHA1: 532c2e14e915dfa522254745bbc068aa6620babb
SHA256: dd1d0569f209fd7f179b85a50fe4bf81b3d850c79b13d32cad88982a8234a719

Release artifacts are signed with the following key:
 https://people.apache.org/keys/committer/joewitt

KEYS file available here:
 https://dist.apache.org/repos/dist/release/nifi/KEYS

268 issues were closed/resolved for this release:
 https://issues.apache.org/jira/secure/ReleaseNote.jspa?projectId=12316020&version=12337875


Release note highlights can be found here:
 https://cwiki.apache.org/confluence/display/NIFI/Release+Notes#ReleaseNotes-Version1.1.0

The vote will be open for 72 hours.
Please download the release candidate and evaluate the necessary items
including checking hashes, signatures, build from source, and test. Then
please vote:

[ ] +1 Release this package as nifi-1.1.0
[ ] +0 no opinion
[ ] -1 Do not release this package because...

Thanks!

Reply | Threaded
Open this post in threaded view
|

Re: [VOTE] Release Apache NiFi 1.1.0 (RC2)

Scott Aslan
In reply to this post by Matt Gilman
+1 (non-binding)

- Verified signatures, checksums, LICENSE, NOTICE, and README
- Built using a full clean build with contrib check successfully on OSX,
with Oracle JDK 1.8.0_77-b03, mvn 3.3.9
- Run example data flows on OS X with Chrome Version 54.0.2840.98 (64-bit) on
unsecured instance
- Run example data flows on OS X with Chrome Version 54.0.2840.98 (64-bit) on
secured instance (using an old 1.0 secured config)


Successfully tested:
* Back pressure UI.
* New restricted-components permission.
* Status Color in the UI
* Canvas component fill color
* User centric policies view

On Mon, Nov 28, 2016 at 9:15 AM, Matt Gilman <[hidden email]>
wrote:

> +1 Release this package as nifi-1.1.0
>
> Ran through numerous configurations including standalone and clustered in
> both secure and unsecured mode and all is working as excepted.
>
> Matt
>
> On Sat, Nov 26, 2016 at 1:11 AM, Joe Witt <[hidden email]> wrote:
>
> > Hello Apache NiFi Community,
> >
> > I am pleased to be calling this vote for the source release of Apache
> NiFi,
> > nifi-1.1.0.
> >
> > The source release zip and convenience binaries, including signatures
> > and digests can be found at:
> >   https://dist.apache.org/repos/dist/dev/nifi/1.0.0-rc2/
> >
> > The Git tag is nifi-1.1.0-RC2
> > The Git commit hash is f61e42c65e1c2387591ee368c2148cd5bda646bd
> > * https://git-wip-us.apache.org/repos/asf?p=nifi.git;a=commit;h=
> > f61e42c65e1c2387591ee368c2148cd5bda646bd
> > * https://github.com/apache/nifi/commit/f61e42c65e1c2387591ee368c2148c
> > d5bda646bd
> >
> > Checksums of nifi-1.1.0-source-release.zip:
> > MD5: 371fb856d9c3947603239ea98f171f6f
> > SHA1: 532c2e14e915dfa522254745bbc068aa6620babb
> > SHA256: dd1d0569f209fd7f179b85a50fe4bf81b3d850c79b13d32cad88982a8234a719
> >
> > Release artifacts are signed with the following key:
> >   https://people.apache.org/keys/committer/joewitt
> >
> > KEYS file available here:
> >   https://dist.apache.org/repos/dist/release/nifi/KEYS
> >
> > 268 issues were closed/resolved for this release:
> >   https://issues.apache.org/jira/secure/ReleaseNote.jspa?
> > projectId=12316020&version=12337875
> >
> >
> > Release note highlights can be found here:
> >   https://cwiki.apache.org/confluence/display/NIFI/
> > Release+Notes#ReleaseNotes-Version1.1.0
> >
> > The vote will be open for 72 hours.
> > Please download the release candidate and evaluate the necessary items
> > including checking hashes, signatures, build from source, and test. Then
> > please vote:
> >
> > [ ] +1 Release this package as nifi-1.1.0
> > [ ] +0 no opinion
> > [ ] -1 Do not release this package because...
> >
> > Thanks!
> >
>



--
*Scott Aslan = new WebDeveloper(*
*{    "location": {        "city": "Saint Cloud",        "state": "FL",
    "zip": "34771"    },    "contact": {        "mobile":
"(321)-591-0870",        "email": "[hidden email]
<[hidden email]>",        "linkedin":
"http://www.linkedin.com/in/scottaslan
<http://www.linkedin.com/in/scottaslan>",        "skype": "astechdev"
}});*
Reply | Threaded
Open this post in threaded view
|

Re: [VOTE] Release Apache NiFi 1.1.0 (RC2)

Bryan Bende
+1 (binding) Release this package as nifi-1.1.0

- Verified everything in release helper
- Ran the resulting binary in standalone mode secure and unsecure and
verified a couple of test flows

The original email said the git commit was
f61e42c65e1c2387591ee368c2148cd5bda646bd
but the commit that actually sets the pom versions to 1.1.0 is the next
commit
https://github.com/apache/nifi/commit/5536f690a81418955442d52687695f65f0a44cd0




On Mon, Nov 28, 2016 at 6:44 AM, Scott Aslan <[hidden email]> wrote:

> +1 (non-binding)
>
> - Verified signatures, checksums, LICENSE, NOTICE, and README
> - Built using a full clean build with contrib check successfully on OSX,
> with Oracle JDK 1.8.0_77-b03, mvn 3.3.9
> - Run example data flows on OS X with Chrome Version 54.0.2840.98 (64-bit)
> on
> unsecured instance
> - Run example data flows on OS X with Chrome Version 54.0.2840.98 (64-bit)
> on
> secured instance (using an old 1.0 secured config)
>
>
> Successfully tested:
> * Back pressure UI.
> * New restricted-components permission.
> * Status Color in the UI
> * Canvas component fill color
> * User centric policies view
>
> On Mon, Nov 28, 2016 at 9:15 AM, Matt Gilman <[hidden email]>
> wrote:
>
> > +1 Release this package as nifi-1.1.0
> >
> > Ran through numerous configurations including standalone and clustered in
> > both secure and unsecured mode and all is working as excepted.
> >
> > Matt
> >
> > On Sat, Nov 26, 2016 at 1:11 AM, Joe Witt <[hidden email]> wrote:
> >
> > > Hello Apache NiFi Community,
> > >
> > > I am pleased to be calling this vote for the source release of Apache
> > NiFi,
> > > nifi-1.1.0.
> > >
> > > The source release zip and convenience binaries, including signatures
> > > and digests can be found at:
> > >   https://dist.apache.org/repos/dist/dev/nifi/1.0.0-rc2/
> > >
> > > The Git tag is nifi-1.1.0-RC2
> > > The Git commit hash is f61e42c65e1c2387591ee368c2148cd5bda646bd
> > > * https://git-wip-us.apache.org/repos/asf?p=nifi.git;a=commit;h=
> > > f61e42c65e1c2387591ee368c2148cd5bda646bd
> > > * https://github.com/apache/nifi/commit/f61e42c65e1c2387591ee368c2148c
> > > d5bda646bd
> > >
> > > Checksums of nifi-1.1.0-source-release.zip:
> > > MD5: 371fb856d9c3947603239ea98f171f6f
> > > SHA1: 532c2e14e915dfa522254745bbc068aa6620babb
> > > SHA256: dd1d0569f209fd7f179b85a50fe4bf81b3d850c79b13d32cad88982a8234
> a719
> > >
> > > Release artifacts are signed with the following key:
> > >   https://people.apache.org/keys/committer/joewitt
> > >
> > > KEYS file available here:
> > >   https://dist.apache.org/repos/dist/release/nifi/KEYS
> > >
> > > 268 issues were closed/resolved for this release:
> > >   https://issues.apache.org/jira/secure/ReleaseNote.jspa?
> > > projectId=12316020&version=12337875
> > >
> > >
> > > Release note highlights can be found here:
> > >   https://cwiki.apache.org/confluence/display/NIFI/
> > > Release+Notes#ReleaseNotes-Version1.1.0
> > >
> > > The vote will be open for 72 hours.
> > > Please download the release candidate and evaluate the necessary items
> > > including checking hashes, signatures, build from source, and test.
> Then
> > > please vote:
> > >
> > > [ ] +1 Release this package as nifi-1.1.0
> > > [ ] +0 no opinion
> > > [ ] -1 Do not release this package because...
> > >
> > > Thanks!
> > >
> >
>
>
>
> --
> *Scott Aslan = new WebDeveloper(*
> *{    "location": {        "city": "Saint Cloud",        "state": "FL",
>     "zip": "34771"    },    "contact": {        "mobile":
> "(321)-591-0870",        "email": "[hidden email]
> <[hidden email]>",        "linkedin":
> "http://www.linkedin.com/in/scottaslan
> <http://www.linkedin.com/in/scottaslan>",        "skype": "astechdev"
> }});*
>
Reply | Threaded
Open this post in threaded view
|

Re: [VOTE] Release Apache NiFi 1.1.0 (RC2)

Joe Percivall
+1 (binding) Release this as nifi-1.1.0

- - - - - - Joseph Percivalllinkedin.com/in/Percivalle: [hidden email]


On Monday, November 28, 2016, 10:25:53 AM EST, Bryan Bende <[hidden email]> wrote:+1 (binding) Release this package as nifi-1.1.0

- Verified everything in release helper
- Ran the resulting binary in standalone mode secure and unsecure and
verified a couple of test flows

The original email said the git commit was
f61e42c65e1c2387591ee368c2148cd5bda646bd
but the commit that actually sets the pom versions to 1.1.0 is the next
commit
https://github.com/apache/nifi/commit/5536f690a81418955442d52687695f65f0a44cd0




On Mon, Nov 28, 2016 at 6:44 AM, Scott Aslan <[hidden email]> wrote:

> +1 (non-binding)
>
> - Verified signatures, checksums, LICENSE, NOTICE, and README
> - Built using a full clean build with contrib check successfully on OSX,
> with Oracle JDK 1.8.0_77-b03, mvn 3.3.9
> - Run example data flows on OS X with Chrome Version 54.0.2840.98 (64-bit)
> on
> unsecured instance
> - Run example data flows on OS X with Chrome Version 54.0.2840.98 (64-bit)
> on
> secured instance (using an old 1.0 secured config)
>
>
> Successfully tested:
> * Back pressure UI.
> * New restricted-components permission.
> * Status Color in the UI
> * Canvas component fill color
> * User centric policies view
>
> On Mon, Nov 28, 2016 at 9:15 AM, Matt Gilman <[hidden email]>
> wrote:
>
> > +1 Release this package as nifi-1.1.0
> >
> > Ran through numerous configurations including standalone and clustered in
> > both secure and unsecured mode and all is working as excepted.
> >
> > Matt
> >
> > On Sat, Nov 26, 2016 at 1:11 AM, Joe Witt <[hidden email]> wrote:
> >
> > > Hello Apache NiFi Community,
> > >
> > > I am pleased to be calling this vote for the source release of Apache
> > NiFi,
> > > nifi-1.1.0.
> > >
> > > The source release zip and convenience binaries, including signatures
> > > and digests can be found at:
> > >  https://dist.apache.org/repos/dist/dev/nifi/1.0.0-rc2/
> > >
> > > The Git tag is nifi-1.1.0-RC2
> > > The Git commit hash is f61e42c65e1c2387591ee368c2148cd5bda646bd
> > > * https://git-wip-us.apache.org/repos/asf?p=nifi.git;a=commit;h=
> > > f61e42c65e1c2387591ee368c2148cd5bda646bd
> > > * https://github.com/apache/nifi/commit/f61e42c65e1c2387591ee368c2148c
> > > d5bda646bd
> > >
> > > Checksums of nifi-1.1.0-source-release.zip:
> > > MD5: 371fb856d9c3947603239ea98f171f6f
> > > SHA1: 532c2e14e915dfa522254745bbc068aa6620babb
> > > SHA256: dd1d0569f209fd7f179b85a50fe4bf81b3d850c79b13d32cad88982a8234
> a719
> > >
> > > Release artifacts are signed with the following key:
> > >  https://people.apache.org/keys/committer/joewitt
> > >
> > > KEYS file available here:
> > >  https://dist.apache.org/repos/dist/release/nifi/KEYS
> > >
> > > 268 issues were closed/resolved for this release:
> > >  https://issues.apache.org/jira/secure/ReleaseNote.jspa?
> > > projectId=12316020&version=12337875
> > >
> > >
> > > Release note highlights can be found here:
> > >  https://cwiki.apache.org/confluence/display/NIFI/
> > > Release+Notes#ReleaseNotes-Version1.1.0
> > >
> > > The vote will be open for 72 hours.
> > > Please download the release candidate and evaluate the necessary items
> > > including checking hashes, signatures, build from source, and test.
> Then
> > > please vote:
> > >
> > > [ ] +1 Release this package as nifi-1.1.0
> > > [ ] +0 no opinion
> > > [ ] -1 Do not release this package because...
> > >
> > > Thanks!
> > >
> >
>
>
>
> --
> *Scott Aslan = new WebDeveloper(*
> *{    "location": {        "city": "Saint Cloud",        "state": "FL",
>    "zip": "34771"    },    "contact": {        "mobile":
> "(321)-591-0870",        "email": "[hidden email]
> <[hidden email]>",        "linkedin":
> "http://www.linkedin.com/in/scottaslan
> <http://www.linkedin.com/in/scottaslan>",        "skype": "astechdev"
> }});*
>
Reply | Threaded
Open this post in threaded view
|

Re: [VOTE] Release Apache NiFi 1.1.0 (RC2)

Ricky Saltzer
+1

Ran verifications, and a sample data flow.

On Mon, Nov 28, 2016 at 12:25 PM, Joe Percivall <
[hidden email]> wrote:

> +1 (binding) Release this as nifi-1.1.0
>
> - - - - - - Joseph Percivalllinkedin.com/in/Percivalle:
> [hidden email]
>
>
> On Monday, November 28, 2016, 10:25:53 AM EST, Bryan Bende <
> [hidden email]> wrote:+1 (binding) Release this package as nifi-1.1.0
>
> - Verified everything in release helper
> - Ran the resulting binary in standalone mode secure and unsecure and
> verified a couple of test flows
>
> The original email said the git commit was
> f61e42c65e1c2387591ee368c2148cd5bda646bd
> but the commit that actually sets the pom versions to 1.1.0 is the next
> commit
> https://github.com/apache/nifi/commit/5536f690a81418955442d52687695f
> 65f0a44cd0
>
>
>
>
> On Mon, Nov 28, 2016 at 6:44 AM, Scott Aslan <[hidden email]>
> wrote:
>
> > +1 (non-binding)
> >
> > - Verified signatures, checksums, LICENSE, NOTICE, and README
> > - Built using a full clean build with contrib check successfully on OSX,
> > with Oracle JDK 1.8.0_77-b03, mvn 3.3.9
> > - Run example data flows on OS X with Chrome Version 54.0.2840.98
> (64-bit)
> > on
> > unsecured instance
> > - Run example data flows on OS X with Chrome Version 54.0.2840.98
> (64-bit)
> > on
> > secured instance (using an old 1.0 secured config)
> >
> >
> > Successfully tested:
> > * Back pressure UI.
> > * New restricted-components permission.
> > * Status Color in the UI
> > * Canvas component fill color
> > * User centric policies view
> >
> > On Mon, Nov 28, 2016 at 9:15 AM, Matt Gilman <[hidden email]>
> > wrote:
> >
> > > +1 Release this package as nifi-1.1.0
> > >
> > > Ran through numerous configurations including standalone and clustered
> in
> > > both secure and unsecured mode and all is working as excepted.
> > >
> > > Matt
> > >
> > > On Sat, Nov 26, 2016 at 1:11 AM, Joe Witt <[hidden email]> wrote:
> > >
> > > > Hello Apache NiFi Community,
> > > >
> > > > I am pleased to be calling this vote for the source release of Apache
> > > NiFi,
> > > > nifi-1.1.0.
> > > >
> > > > The source release zip and convenience binaries, including signatures
> > > > and digests can be found at:
> > > >  https://dist.apache.org/repos/dist/dev/nifi/1.0.0-rc2/
> > > >
> > > > The Git tag is nifi-1.1.0-RC2
> > > > The Git commit hash is f61e42c65e1c2387591ee368c2148cd5bda646bd
> > > > * https://git-wip-us.apache.org/repos/asf?p=nifi.git;a=commit;h=
> > > > f61e42c65e1c2387591ee368c2148cd5bda646bd
> > > > * https://github.com/apache/nifi/commit/
> f61e42c65e1c2387591ee368c2148c
> > > > d5bda646bd
> > > >
> > > > Checksums of nifi-1.1.0-source-release.zip:
> > > > MD5: 371fb856d9c3947603239ea98f171f6f
> > > > SHA1: 532c2e14e915dfa522254745bbc068aa6620babb
> > > > SHA256: dd1d0569f209fd7f179b85a50fe4bf81b3d850c79b13d32cad88982a8234
> > a719
> > > >
> > > > Release artifacts are signed with the following key:
> > > >  https://people.apache.org/keys/committer/joewitt
> > > >
> > > > KEYS file available here:
> > > >  https://dist.apache.org/repos/dist/release/nifi/KEYS
> > > >
> > > > 268 issues were closed/resolved for this release:
> > > >  https://issues.apache.org/jira/secure/ReleaseNote.jspa?
> > > > projectId=12316020&version=12337875
> > > >
> > > >
> > > > Release note highlights can be found here:
> > > >  https://cwiki.apache.org/confluence/display/NIFI/
> > > > Release+Notes#ReleaseNotes-Version1.1.0
> > > >
> > > > The vote will be open for 72 hours.
> > > > Please download the release candidate and evaluate the necessary
> items
> > > > including checking hashes, signatures, build from source, and test.
> > Then
> > > > please vote:
> > > >
> > > > [ ] +1 Release this package as nifi-1.1.0
> > > > [ ] +0 no opinion
> > > > [ ] -1 Do not release this package because...
> > > >
> > > > Thanks!
> > > >
> > >
> >
> >
> >
> > --
> > *Scott Aslan = new WebDeveloper(*
> > *{    "location": {        "city": "Saint Cloud",        "state": "FL",
> >    "zip": "34771"    },    "contact": {        "mobile":
> > "(321)-591-0870",        "email": "[hidden email]
> > <[hidden email]>",        "linkedin":
> > "http://www.linkedin.com/in/scottaslan
> > <http://www.linkedin.com/in/scottaslan>",        "skype": "astechdev"
> > }});*
> >
>



--
Ricky Saltzer
http://www.cloudera.com
Reply | Threaded
Open this post in threaded view
|

Re: [VOTE] Release Apache NiFi 1.1.0 (RC2)

Matt Burgess-2
In reply to this post by joewitt
+1 (binding) Release this package as nifi-1.1.0

On Sat, Nov 26, 2016 at 1:11 AM, Joe Witt <[hidden email]> wrote:

> Hello Apache NiFi Community,
>
> I am pleased to be calling this vote for the source release of Apache NiFi,
> nifi-1.1.0.
>
> The source release zip and convenience binaries, including signatures
> and digests can be found at:
>   https://dist.apache.org/repos/dist/dev/nifi/1.0.0-rc2/
>
> The Git tag is nifi-1.1.0-RC2
> The Git commit hash is f61e42c65e1c2387591ee368c2148cd5bda646bd
> * https://git-wip-us.apache.org/repos/asf?p=nifi.git;a=commit;h=f61e42c65e1c2387591ee368c2148cd5bda646bd
> * https://github.com/apache/nifi/commit/f61e42c65e1c2387591ee368c2148cd5bda646bd
>
> Checksums of nifi-1.1.0-source-release.zip:
> MD5: 371fb856d9c3947603239ea98f171f6f
> SHA1: 532c2e14e915dfa522254745bbc068aa6620babb
> SHA256: dd1d0569f209fd7f179b85a50fe4bf81b3d850c79b13d32cad88982a8234a719
>
> Release artifacts are signed with the following key:
>   https://people.apache.org/keys/committer/joewitt
>
> KEYS file available here:
>   https://dist.apache.org/repos/dist/release/nifi/KEYS
>
> 268 issues were closed/resolved for this release:
>   https://issues.apache.org/jira/secure/ReleaseNote.jspa?projectId=12316020&version=12337875
>
>
> Release note highlights can be found here:
>   https://cwiki.apache.org/confluence/display/NIFI/Release+Notes#ReleaseNotes-Version1.1.0
>
> The vote will be open for 72 hours.
> Please download the release candidate and evaluate the necessary items
> including checking hashes, signatures, build from source, and test. Then
> please vote:
>
> [ ] +1 Release this package as nifi-1.1.0
> [ ] +0 no opinion
> [ ] -1 Do not release this package because...
>
> Thanks!
Reply | Threaded
Open this post in threaded view
|

Re: [VOTE] Release Apache NiFi 1.1.0 (RC2)

Jeff
In reply to this post by Bryan Bende
+1 (non-binding)

Went through the release guide, everything looked good with the exception
of a couple nit-picks:

git commit hash for RC2 is 5536f690a81418955442d52687695f65f0a44cd0 instead
of f61e42c65e1c2387591ee368c2148cd5bda646bd
README.md references version 1.0.0 rather than 1.1.0 in the Getting
Started: To Deploy section.
README.md states JDK 1.8 or newer is required, but the README states JDK 1.7

Built on OSX with Java build 1.8.0_102-b14, all tests passed.

Ran on OSX with some sample flows, works as expected.

Built on WIndows 7 with Java (build 1.8.0_77-b03), build eventually passed.
Saw an intermittent failure when running the tests for
nifi-lumberjack-processors, specifically
TestLumberjackSocketChannelHandler.testBasicHandling.  A re-run of the test
was successful.

Ran on Windows 7 with some sample flows, works as expected.

On Mon, Nov 28, 2016 at 10:25 AM Bryan Bende <[hidden email]> wrote:

+1 (binding) Release this package as nifi-1.1.0

- Verified everything in release helper
- Ran the resulting binary in standalone mode secure and unsecure and
verified a couple of test flows

The original email said the git commit was
f61e42c65e1c2387591ee368c2148cd5bda646bd
but the commit that actually sets the pom versions to 1.1.0 is the next
commit
https://github.com/apache/nifi/commit/5536f690a81418955442d52687695f65f0a44cd0




On Mon, Nov 28, 2016 at 6:44 AM, Scott Aslan <[hidden email]> wrote:

> +1 (non-binding)
>
> - Verified signatures, checksums, LICENSE, NOTICE, and README
> - Built using a full clean build with contrib check successfully on OSX,
> with Oracle JDK 1.8.0_77-b03, mvn 3.3.9
> - Run example data flows on OS X with Chrome Version 54.0.2840.98 (64-bit)
> on
> unsecured instance
> - Run example data flows on OS X with Chrome Version 54.0.2840.98 (64-bit)
> on
> secured instance (using an old 1.0 secured config)
>
>
> Successfully tested:
> * Back pressure UI.
> * New restricted-components permission.
> * Status Color in the UI
> * Canvas component fill color
> * User centric policies view
>
> On Mon, Nov 28, 2016 at 9:15 AM, Matt Gilman <[hidden email]>
> wrote:
>
> > +1 Release this package as nifi-1.1.0
> >
> > Ran through numerous configurations including standalone and clustered
in

> > both secure and unsecured mode and all is working as excepted.
> >
> > Matt
> >
> > On Sat, Nov 26, 2016 at 1:11 AM, Joe Witt <[hidden email]> wrote:
> >
> > > Hello Apache NiFi Community,
> > >
> > > I am pleased to be calling this vote for the source release of Apache
> > NiFi,
> > > nifi-1.1.0.
> > >
> > > The source release zip and convenience binaries, including signatures
> > > and digests can be found at:
> > >   https://dist.apache.org/repos/dist/dev/nifi/1.0.0-rc2/
> > >
> > > The Git tag is nifi-1.1.0-RC2
> > > The Git commit hash is f61e42c65e1c2387591ee368c2148cd5bda646bd
> > > * https://git-wip-us.apache.org/repos/asf?p=nifi.git;a=commit;h=
> > > f61e42c65e1c2387591ee368c2148cd5bda646bd
> > > * https://github.com/apache/nifi/commit/f61e42c65e1c2387591ee368c2148c
> > > d5bda646bd
> > >
> > > Checksums of nifi-1.1.0-source-release.zip:
> > > MD5: 371fb856d9c3947603239ea98f171f6f
> > > SHA1: 532c2e14e915dfa522254745bbc068aa6620babb
> > > SHA256: dd1d0569f209fd7f179b85a50fe4bf81b3d850c79b13d32cad88982a8234
> a719
> > >
> > > Release artifacts are signed with the following key:
> > >   https://people.apache.org/keys/committer/joewitt
> > >
> > > KEYS file available here:
> > >   https://dist.apache.org/repos/dist/release/nifi/KEYS
> > >
> > > 268 issues were closed/resolved for this release:
> > >   https://issues.apache.org/jira/secure/ReleaseNote.jspa?
> > > projectId=12316020&version=12337875
> > >
> > >
> > > Release note highlights can be found here:
> > >   https://cwiki.apache.org/confluence/display/NIFI/
> > > Release+Notes#ReleaseNotes-Version1.1.0
> > >
> > > The vote will be open for 72 hours.
> > > Please download the release candidate and evaluate the necessary items
> > > including checking hashes, signatures, build from source, and test.
> Then
> > > please vote:
> > >
> > > [ ] +1 Release this package as nifi-1.1.0
> > > [ ] +0 no opinion
> > > [ ] -1 Do not release this package because...
> > >
> > > Thanks!
> > >
> >
>
>
>
> --
> *Scott Aslan = new WebDeveloper(*
> *{    "location": {        "city": "Saint Cloud",        "state": "FL",
>     "zip": "34771"    },    "contact": {        "mobile":
> "(321)-591-0870 <(321)%20591-0870>",        "email": "
[hidden email]
> <[hidden email]>",        "linkedin":
> "http://www.linkedin.com/in/scottaslan
> <http://www.linkedin.com/in/scottaslan>",        "skype": "astechdev"
> }});*
>
Reply | Threaded
Open this post in threaded view
|

Re: [VOTE] Release Apache NiFi 1.1.0 (RC2)

Joe Skora
In reply to this post by Matt Burgess-2
+1 (non-binding) but there are README issues

* Signature and hashes checkout
* Source builds and tests (Ubuntu 14.04.5 LTS)
* LICENSE and NOTICE look correct (without a detailed analysis)
* README is incorrect [1]
* binaries run as expected

[1] the built README lists requirements of "JDK 1.7 or higher" but this
should be "JDK 1.8 or higher" which was committed to master on 8/8/2016.

On Mon, Nov 28, 2016 at 5:33 PM, Matt Burgess <[hidden email]> wrote:

> +1 (binding) Release this package as nifi-1.1.0
>
> On Sat, Nov 26, 2016 at 1:11 AM, Joe Witt <[hidden email]> wrote:
> > Hello Apache NiFi Community,
> >
> > I am pleased to be calling this vote for the source release of Apache
> NiFi,
> > nifi-1.1.0.
> >
> > The source release zip and convenience binaries, including signatures
> > and digests can be found at:
> >   https://dist.apache.org/repos/dist/dev/nifi/1.0.0-rc2/
> >
> > The Git tag is nifi-1.1.0-RC2
> > The Git commit hash is f61e42c65e1c2387591ee368c2148cd5bda646bd
> > * https://git-wip-us.apache.org/repos/asf?p=nifi.git;a=commit;h=
> f61e42c65e1c2387591ee368c2148cd5bda646bd
> > * https://github.com/apache/nifi/commit/f61e42c65e1c2387591ee368c2148c
> d5bda646bd
> >
> > Checksums of nifi-1.1.0-source-release.zip:
> > MD5: 371fb856d9c3947603239ea98f171f6f
> > SHA1: 532c2e14e915dfa522254745bbc068aa6620babb
> > SHA256: dd1d0569f209fd7f179b85a50fe4bf81b3d850c79b13d32cad88982a8234a719
> >
> > Release artifacts are signed with the following key:
> >   https://people.apache.org/keys/committer/joewitt
> >
> > KEYS file available here:
> >   https://dist.apache.org/repos/dist/release/nifi/KEYS
> >
> > 268 issues were closed/resolved for this release:
> >   https://issues.apache.org/jira/secure/ReleaseNote.jspa?
> projectId=12316020&version=12337875
> >
> >
> > Release note highlights can be found here:
> >   https://cwiki.apache.org/confluence/display/NIFI/
> Release+Notes#ReleaseNotes-Version1.1.0
> >
> > The vote will be open for 72 hours.
> > Please download the release candidate and evaluate the necessary items
> > including checking hashes, signatures, build from source, and test. Then
> > please vote:
> >
> > [ ] +1 Release this package as nifi-1.1.0
> > [ ] +0 no opinion
> > [ ] -1 Do not release this package because...
> >
> > Thanks!
>
12